{"text_format":"3","workbook":"xlsx","n_sheets":80,"sheets":["INVENTARIOS","MATERIA PRIMA Y MATERIALES","M1","M2","M3","M4","M5","M6","M7","M8","M9","M10","M11","M12","M13","M14","M15","M16","M17","M18","M19","M20","M21","M22","M23","M24","M25","M26","M27","M28","M29","M30","M31","M32","M33","M34","M35","M36","M37","M38","M39","M40","M41","M42","M43","M44","M45","M46","M47","M48","M49","M50","M51","M52","M53","S1","S2","S3","S4","S5","S6","S7","S8","S9","S10","S11","S12","S13","S14","S15","S16","S17","S18","S19","S20","S21","S22","S23","INFORME DE INVENTARIOS","REPORTES"],"not_rendered":{"images":1,"macros":1,"defined_names":6},"unopened":[{"sheet":"INVENTARIOS","index":0,"reason":"not_a_worksheet"}],"read":"whole","date_system":"1900"}

{"sheet":"MATERIA PRIMA Y MATERIALES","index":1,"n_rows":61,"n_cols":5,"rows_kept":61,"merged":[[0,0,0,12],[2,0,2,12]]}
["RESTAURANTE CAMINOS DE HERRADURA"]
[]
["INVENTARIOS"]
[]
[]
[]
[]
[]
[{"$nulls":3},"CODIGO","MATERIA PRIMA"]
[{"$nulls":3},"1.1.04.01","COCINAS INDUSTRIALES GRANDES"]
[{"$nulls":3},"1.1.04.02","COCINAS INDUSTRIALES  PEQUEÑAS"]
[{"$nulls":3},"1.1.04.03","REFRIGERADORA 13 PIES"]
[{"$nulls":3},"1.1.04.04","CONGELADOR"]
[{"$nulls":3},"1.1.04.05","HORNO INDUSTRIAL"]
[{"$nulls":3},"1.1.04.06","REPISA PARA VAJILLA"]
[{"$nulls":3},"1.1.04.07","MESA"]
[{"$nulls":3},"1.1.04.08","TANQUES DE GAS"]
[{"$nulls":3},"1.1.04.09","OLLAS DE PRESIÓN"]
[{"$nulls":3},"1.1.04.10","OLLAS CON TAPAS GRANDES"]
[{"$nulls":3},"1.1.04.11","OLLAS CON TAPAS MEDIANAS"]
[{"$nulls":3},"1.1.04.12","OLLAS CON TAPAS PEQUEÑAS"]
[{"$nulls":3},"1.1.04.13","VALDES"]
[{"$nulls":3},"1.1.04.14","PAILA"]
[{"$nulls":3},"1.1.04.15","LICUADORA INDUSTRIAL"]
[{"$nulls":3},"1.1.04.16","LICUADORA OSTER"]
[{"$nulls":3},"1.1.04.17","FREIDORES"]
[{"$nulls":3},"1.1.04.18","REFRIGERADORA MABE"]
[{"$nulls":3},"1.1.04.19","DAEWOO"]
[{"$nulls":3},"1.1.04.20","EQUIPO DE SONIDO SONY"]
[{"$nulls":3},"1.1.04.21","MESAS  2 METROS"]
[{"$nulls":3},"1.1.04.22","MESAS 1 METRO"]
[{"$nulls":3},"1.1.04.23","SILLAS NEGRAS"]
[{"$nulls":3},"1.1.04.24","MANTELES MANTECA  M/2m"]
[{"$nulls":3},"1.1.04.25","SOBREMANTELES AMARILLOS"]
[{"$nulls":3},"1.1.04.26","SOBREMANTELES ROJOS"]
[{"$nulls":3},"1.1.04.27","SOBREMANTELES DORADOS"]
[{"$nulls":3},"1.1.04.28","SOBREMANTELES ROSADOS"]
[{"$nulls":3},"1.1.04.29","MANTELES COLORES M/1m"]
[{"$nulls":3},"1.1.04.30","VIDRIOS  M/1m"]
[{"$nulls":3},"1.1.04.31","SALEROS"]
[{"$nulls":3},"1.1.04.32","CAJAS PARA CUBIERTOS "]
[{"$nulls":3},"1.1.04.33","BAR"]
[{"$nulls":3},"1.1.04.34","CUCHARAS"]
[{"$nulls":3},"1.1.04.35","CUCHILLOS DE MESA"]
[{"$nulls":3},"1.1.04.36","CUHARILLAS"]
[{"$nulls":3},"1.1.04.37","CUCHILLOS DE COCINA"]
[{"$nulls":3},"1.1.04.38","CUCHARETAS"]
[{"$nulls":3},"1.1.04.39","CUCHARONES"]
[{"$nulls":3},"1.1.04.40","DIABLO"]
[{"$nulls":3},"1.1.04.41","PLATO SOPERO"]
[{"$nulls":3},"1.1.04.42","PLATO FUERTE"]
[{"$nulls":3},"1.1.04.43","PLATO ENTRADA"]
[{"$nulls":3},"1.1.04.44","PLATO POSTRE"]
[{"$nulls":3},"1.1.04.45","VASO"]
[{"$nulls":3},"1.1.04.46","COPA DE AGUA"]
[{"$nulls":3},"1.1.04.47","COPA DE VINO"]
[{"$nulls":3},"1.1.04.48","CENICEROS"]
[{"$nulls":3},"1.1.04.49","TENEDORES"]
[{"$nulls":3},"1.1.04.50","SERVILLETAS"]
[{"$nulls":3},"1.1.04.51","CONTRATOS"]
[{"$nulls":3},"1.1.04.52","#'M53'!A1"]

{"sheet":"M1","index":2,"n_rows":12,"n_cols":13,"rows_kept":12,"merged":[[0,0,0,12],[2,0,2,12],[5,6,5,7],[7,0,8,0],[7,1,8,1],[7,2,8,2],[7,3,7,5],[7,6,7,8],[7,9,7,11],[7,12,8,12]]}
["RESTAURANTE CAMINOS DE HERRADURA"]
[]
["KARDEX"]
[]
["Artículo:",{"$f":"'MATERIA PRIMA Y MATERIALES'!E10","v":"COCINAS INDUSTRIALES GRANDES"},null,null,"Unidad de medida:",null,"UNIDADES",null,"Codigo:",{"$f":"'MATERIA PRIMA Y MATERIALES'!D10","v":"1.1.04.01"}]
[{"$nulls":4},"Fecha de Corte:",null,{"$f":"NOW()","v":"2010-06-10T17:05:11.150"}]
[]
["FECHA","ORDEN DE \nPRODUCCIÓN","DETALLE",{"$nulls":6},"EXISTENCIAS",null,null,"RESPONSABLE"]
[{"$nulls":3},"CANT.","P.U.","P.T.","CANT.","P.U.","P.T.","CANT.","P.U.","P.T."]
[{"$nulls":9},3,{"v":180,"d":"$180.00"},{"v":540,"d":"$540.00"}]
[]
["2010-02-01",null,"SITUACIÓN INICIAL",3,{"v":180,"d":"$180.00"},{"$f":"$D$12*$E$12","v":{"v":540,"d":"$540.00"}},{"$nulls":3},{"$f":"J13+D12","v":3},{"$f":"$L$12/$J$12","v":{"v":180,"d":"$180.00"}},{"$f":"L13+F12","v":{"v":540,"d":"$540.00"}}]

{"sheet":"M2","index":3,"n_rows":12,"n_cols":13,"rows_kept":12,"merged":[[0,0,0,12],[2,0,2,12],[5,6,5,7],[7,0,8,0],[7,1,8,1],[7,2,8,2],[7,3,7,5],[7,6,7,8],[7,9,7,11],[7,12,8,12]]}
["RESTAURANTE CAMINOS DE HERRADURA"]
[]
["KARDEX"]
[]
["Artículo:",{"$f":"'MATERIA PRIMA Y MATERIALES'!E11","v":"COCINAS INDUSTRIALES  PEQUEÑAS"},null,null,"Unidad de medida:",null,{"$f":"'M1'!$G$5","v":"UNIDADES"},null,"Codigo:",{"$f":"'MATERIA PRIMA Y MATERIALES'!D11","v":"1.1.04.02"}]
[{"$nulls":4},"Fecha de Corte:",null,{"$f":"NOW()","v":"2010-06-10T17:05:11.150"}]
[]
["FECHA","ORDEN DE \nPRODUCCIÓN","DETALLE",{"$nulls":6},"EXISTENCIAS",null,null,"RESPONSABLE"]
[{"$nulls":3},"CANT.","P.U.","P.T.","CANT.","P.U.","P.T.","CANT.","P.U.","P.T."]
[{"$nulls":9},2,{"v":90,"d":"$90.00"},{"v":180,"d":"$180.00"}]
[]
["2010-02-01",null,"SITUACIÓN INICIAL",2,{"v":90,"d":"$90.00"},{"$f":"$D$12*$E$12","v":{"v":180,"d":"$180.00"}},{"$nulls":3},{"$f":"J13+D12","v":2},{"$f":"$L$12/$J$12","v":{"v":90,"d":"$90.00"}},{"$f":"L13+F12","v":{"v":180,"d":"$180.00"}}]

{"sheet":"M3","index":4,"n_rows":12,"n_cols":13,"rows_kept":12,"merged":[[0,0,0,12],[2,0,2,12],[5,6,5,7],[7,0,8,0],[7,1,8,1],[7,2,8,2],[7,3,7,5],[7,6,7,8],[7,9,7,11],[7,12,8,12]]}
["RESTAURANTE CAMINOS DE HERRADURA"]
[]
["KARDEX"]
[]
["Artículo:",{"$f":"'MATERIA PRIMA Y MATERIALES'!E12","v":"REFRIGERADORA 13 PIES"},null,null,"Unidad de medida:",null,{"$f":"'M1'!$G$5","v":"UNIDADES"},null,"Codigo:",{"$f":"'MATERIA PRIMA Y MATERIALES'!D12","v":"1.1.04.03"}]
[{"$nulls":4},"Fecha de Corte:",null,{"$f":"NOW()","v":"2010-06-10T17:05:11.150"}]
[]
["FECHA","ORDEN DE \nPRODUCCIÓN","DETALLE","ENTRADAS",null,null,"SALIDAS",null,null,"EXISTENCIAS",null,null,"RESPONSABLE"]
[{"$nulls":3},"CANT.","P.U.","P.T.","CANT.","P.U.","P.T.","CANT.","P.U.","P.T."]
[{"$nulls":9},1,{"v":180,"d":"$180.00"},{"v":180,"d":"$180.00"}]
[]
["2010-02-01",null,"SITUACIÓN INICIAL",1,{"v":180,"d":"$180.00"},{"$f":"$D$12*$E$12","v":{"v":180,"d":"$180.00"}},{"$nulls":3},{"$f":"J13+D12","v":1},{"$f":"$L$12/$J$12","v":{"v":180,"d":"$180.00"}},{"$f":"L13+F12","v":{"v":180,"d":"$180.00"}}]

{"sheet":"M4","index":5,"n_rows":12,"n_cols":13,"rows_kept":12,"merged":[[0,0,0,12],[2,0,2,12],[5,6,5,7],[7,0,8,0],[7,1,8,1],[7,2,8,2],[7,3,7,5],[7,6,7,8],[7,9,7,11],[7,12,8,12]]}
["RESTAURANTE CAMINOS DE HERRADURA"]
[]
["KARDEX"]
[]
["Artículo:",{"$f":"'MATERIA PRIMA Y MATERIALES'!E13","v":"CONGELADOR"},null,null,"Unidad de medida:",null,{"$f":"'M1'!$G$5","v":"UNIDADES"},null,"Codigo:",{"$f":"'MATERIA PRIMA Y MATERIALES'!D13","v":"1.1.04.04"}]
[{"$nulls":4},"Fecha de Corte:",null,{"$f":"NOW()","v":"2010-06-10T17:05:11.150"}]
[]
["FECHA","ORDEN DE \nPRODUCCIÓN","DETALLE",{"$nulls":6},"EXISTENCIAS",null,null,"RESPONSABLE"]
[{"$nulls":3},"CANT.","P.U.","P.T.","CANT.","P.U.","P.T.","CANT.","P.U.","P.T."]
[{"$nulls":9},1,{"v":700,"d":"$700.00"},{"v":700,"d":"$700.00"}]
[]
["2010-02-01",null,"SITUACIÓN INICIAL",1,{"v":700,"d":"$700.00"},{"$f":"$D$12*$E$12","v":{"v":700,"d":"$700.00"}},{"$nulls":3},{"$f":"J13+D12","v":1},{"$f":"$L$12/$J$12","v":{"v":700,"d":"$700.00"}},{"$f":"L13+F12","v":{"v":700,"d":"$700.00"}}]

{"sheet":"M5","index":6,"n_rows":12,"n_cols":13,"rows_kept":12,"merged":[[0,0,0,12],[2,0,2,12],[5,6,5,7],[7,0,8,0],[7,1,8,1],[7,2,8,2],[7,3,7,5],[7,6,7,8],[7,9,7,11],[7,12,8,12]]}
["RESTAURANTE CAMINOS DE HERRADURA"]
[]
["KARDEX"]
[]
["Artículo:",{"$f":"'MATERIA PRIMA Y MATERIALES'!E14","v":"HORNO INDUSTRIAL"},null,null,"Unidad de medida:",null,{"$f":"'M1'!$G$5","v":"UNIDADES"},null,"Codigo:",{"$f":"'MATERIA PRIMA Y MATERIALES'!D14","v":"1.1.04.05"}]
[{"$nulls":4},"Fecha de Corte:",null,{"$f":"NOW()","v":"2010-06-10T17:05:11.150"}]
[]
["FECHA","ORDEN DE \nPRODUCCIÓN","DETALLE",{"$nulls":6},"EXISTENCIAS",null,null,"RESPONSABLE"]
[{"$nulls":3},"CANT.","P.U.","P.T.","CANT.","P.U.","P.T.","CANT.","P.U.","P.T."]
[{"$nulls":9},1,{"v":500,"d":"$500.00"},{"v":500,"d":"$500.00"}]
[]
["2010-02-01",null,"SITUACIÓN INICIAL",1,{"v":500,"d":"$500.00"},{"$f":"$D$12*$E$12","v":{"v":500,"d":"$500.00"}},{"$nulls":3},{"$f":"J13+D12","v":1},{"$f":"$L$12/$J$12","v":{"v":500,"d":"$500.00"}},{"$f":"L13+F12","v":{"v":500,"d":"$500.00"}}]

{"sheet":"M6","index":7,"n_rows":12,"n_cols":13,"rows_kept":12,"merged":[[0,0,0,12],[2,0,2,12],[5,6,5,7],[7,0,8,0],[7,1,8,1],[7,2,8,2],[7,3,7,5],[7,6,7,8],[7,9,7,11],[7,12,8,12]]}
["RESTAURANTE CAMINOS DE HERRADURA"]
[]
["KARDEX"]
[]
["Artículo:",{"$f":"'MATERIA PRIMA Y MATERIALES'!E15","v":"REPISA PARA VAJILLA"},null,null,"Unidad de medida:",null,{"$f":"'M1'!$G$5","v":"UNIDADES"},null,"Codigo:",{"$f":"'MATERIA PRIMA Y MATERIALES'!D15","v":"1.1.04.06"}]
[{"$nulls":4},"Fecha de Corte:",null,{"$f":"NOW()","v":"2010-06-10T17:05:11.150"}]
[]
["FECHA","ORDEN DE \nPRODUCCIÓN","DETALLE",{"$nulls":6},"EXISTENCIAS",null,null,"RESPONSABLE"]
[{"$nulls":3},"CANT.","P.U.","P.T.","CANT.","P.U.","P.T.","CANT.","P.U.","P.T."]
[{"$nulls":9},1,{"v":150,"d":"$150.00"},{"v":150,"d":"$150.00"}]
[]
["2010-02-01",null,"SITUACIÓN INICIAL",1,{"v":150,"d":"$150.00"},{"$f":"$D$12*$E$12","v":{"v":150,"d":"$150.00"}},{"$nulls":3},{"$f":"J13+D12","v":1},{"$f":"$L$12/$J$12","v":{"v":150,"d":"$150.00"}},{"$f":"L13+F12","v":{"v":150,"d":"$150.00"}}]

{"sheet":"M7","index":8,"n_rows":12,"n_cols":13,"rows_kept":12,"merged":[[0,0,0,12],[2,0,2,12],[5,6,5,7],[7,0,8,0],[7,1,8,1],[7,2,8,2],[7,3,7,5],[7,6,7,8],[7,9,7,11],[7,12,8,12]]}
["RESTAURANTE CAMINOS DE HERRADURA"]
[]
["KARDEX"]
[]
["Artículo:",{"$f":"'MATERIA PRIMA Y MATERIALES'!E16","v":"MESA"},null,null,"Unidad de medida:",null,"UNIDADES",null,"Codigo:",{"$f":"'MATERIA PRIMA Y MATERIALES'!D16","v":"1.1.04.07"}]
[{"$nulls":4},"Fecha de Corte:",null,{"$f":"NOW()","v":"2010-06-10T17:05:11.150"}]
[]
["FECHA","ORDEN DE \nPRODUCCIÓN","DETALLE",{"$nulls":6},"EXISTENCIAS",null,null,"RESPONSABLE"]
[{"$nulls":3},"CANT.","P.U.","P.T.","CANT.","P.U.","P.T.","CANT.","P.U.","P.T."]
[{"$nulls":9},1,{"v":90,"d":"$90.00"},{"v":90,"d":"$90.00"}]
[]
["2010-02-01",null,"SITUACIÓN INICIAL",1,{"v":90,"d":"$90.00"},{"$f":"$D$12*$E$12","v":{"v":90,"d":"$90.00"}},{"$nulls":3},{"$f":"J13+D12","v":1},{"$f":"$L$12/$J$12","v":{"v":90,"d":"$90.00"}},{"$f":"L13+F12","v":{"v":90,"d":"$90.00"}}]

{"sheet":"M8","index":9,"n_rows":12,"n_cols":13,"rows_kept":12,"merged":[[0,0,0,12],[2,0,2,12],[5,6,5,7],[7,0,8,0],[7,1,8,1],[7,2,8,2],[7,3,7,5],[7,6,7,8],[7,9,7,11],[7,12,8,12]]}
["RESTAURANTE CAMINOS DE HERRADURA"]
[]
["KARDEX"]
[]
["Artículo:",{"$f":"'MATERIA PRIMA Y MATERIALES'!E17","v":"TANQUES DE GAS"},null,null,"Unidad de medida:",null,"UNIDADES",null,"Codigo:",{"$f":"'MATERIA PRIMA Y MATERIALES'!D17","v":"1.1.04.08"}]
[{"$nulls":4},"Fecha de Corte:",null,{"$f":"NOW()","v":"2010-06-10T17:05:11.150"}]
[]
["FECHA","ORDEN DE \nPRODUCCIÓN","DETALLE",{"$nulls":6},"EXISTENCIAS",null,null,"RESPONSABLE"]
[{"$nulls":3},"CANT.","P.U.","P.T.","CANT.","P.U.","P.T.","CANT.","P.U.","P.T."]
[{"$nulls":9},6,{"v":30,"d":"$30.00"},{"v":180,"d":"$180.00"}]
[]
["2010-02-01",null,"SITUACIÓN INICIAL",6,{"v":30,"d":"$30.00"},{"$f":"$D$12*$E$12","v":{"v":180,"d":"$180.00"}},{"$nulls":3},{"$f":"J13+D12","v":6},{"$f":"$L$12/$J$12","v":{"v":30,"d":"$30.00"}},{"$f":"L13+F12","v":{"v":180,"d":"$180.00"}}]

{"sheet":"M9","index":10,"n_rows":12,"n_cols":13,"rows_kept":12,"merged":[[0,0,0,12],[2,0,2,12],[5,6,5,7],[7,0,8,0],[7,1,8,1],[7,2,8,2],[7,3,7,5],[7,6,7,8],[7,9,7,11],[7,12,8,12]]}
["RESTAURANTE CAMINOS DE HERRADURA"]
[]
["KARDEX"]
[]
["Artículo:",{"$f":"'MATERIA PRIMA Y MATERIALES'!E18","v":"OLLAS DE PRESIÓN"},null,null,"Unidad de medida:",null,"UNIDADES",null,"Codigo:",{"$f":"'MATERIA PRIMA Y MATERIALES'!D18","v":"1.1.04.09"}]
[{"$nulls":4},"Fecha de Corte:",null,{"$f":"NOW()","v":"2010-06-10T17:05:11.150"}]
[]
["FECHA","ORDEN DE \nPRODUCCIÓN","DETALLE",{"$nulls":6},"EXISTENCIAS",null,null,"RESPONSABLE"]
[{"$nulls":3},"CANT.","P.U.","P.T.","CANT.","P.U.","P.T.","CANT.","P.U.","P.T."]
[{"$nulls":9},5,{"v":60,"d":"$60.00"},{"v":300,"d":"$300.00"}]
[]
["2010-02-01",null,"SITUACIÓN INICIAL",5,{"v":60,"d":"$60.00"},{"$f":"$D$12*$E$12","v":{"v":300,"d":"$300.00"}},{"$nulls":3},{"$f":"J13+D12","v":5},{"$f":"$L$12/$J$12","v":{"v":60,"d":"$60.00"}},{"$f":"L13+F12","v":{"v":300,"d":"$300.00"}}]

{"sheet":"M10","index":11,"n_rows":12,"n_cols":13,"rows_kept":12,"merged":[[0,0,0,12],[2,0,2,12],[5,6,5,7],[7,0,8,0],[7,1,8,1],[7,2,8,2],[7,3,7,5],[7,6,7,8],[7,9,7,11],[7,12,8,12]]}
["RESTAURANTE CAMINOS DE HERRADURA"]
[]
["KARDEX"]
[]
["Artículo:",{"$f":"'MATERIA PRIMA Y MATERIALES'!E19","v":"OLLAS CON TAPAS GRANDES"},null,null,"Unidad de medida:",null,"UNIDADES",null,"Codigo:",{"$f":"'MATERIA PRIMA Y MATERIALES'!D19","v":"1.1.04.10"}]
[{"$nulls":4},"Fecha de Corte:",null,{"$f":"NOW()","v":"2010-06-10T17:05:11.150"}]
[]
["FECHA","ORDEN DE \nPRODUCCIÓN","DETALLE",{"$nulls":6},"EXISTENCIAS",null,null,"RESPONSABLE"]
[{"$nulls":3},"CANT.","P.U.","P.T.","CANT.","P.U.","P.T.","CANT.","P.U.","P.T."]
[{"$nulls":9},4,{"v":130,"d":"$130.00"},{"v":520,"d":"$520.00"}]
[]
["2010-02-01",null,"SITUACIÓN INICIAL",4,{"v":130,"d":"$130.00"},{"$f":"$D$12*$E$12","v":{"v":520,"d":"$520.00"}},{"$nulls":3},{"$f":"J13+D12","v":4},{"$f":"$L$12/$J$12","v":{"v":130,"d":"$130.00"}},{"$f":"L13+F12","v":{"v":520,"d":"$520.00"}}]

{"sheet":"M11","index":12,"n_rows":12,"n_cols":13,"rows_kept":12,"merged":[[0,0,0,12],[2,0,2,12],[5,6,5,7],[7,0,8,0],[7,1,8,1],[7,2,8,2],[7,3,7,5],[7,6,7,8],[7,9,7,11],[7,12,8,12]]}
["RESTAURANTE CAMINOS DE HERRADURA"]
[]
["KARDEX"]
[]
["Artículo:",{"$f":"'MATERIA PRIMA Y MATERIALES'!E20","v":"OLLAS CON TAPAS MEDIANAS"},null,null,"Unidad de medida:",null,"UNIDADES",null,"Codigo:",{"$f":"'MATERIA PRIMA Y MATERIALES'!D20","v":"1.1.04.11"}]
[{"$nulls":4},"Fecha de Corte:",null,{"$f":"NOW()","v":"2010-06-10T17:05:11.150"}]
[]
["FECHA","ORDEN DE \nPRODUCCIÓN","DETALLE",{"$nulls":6},"EXISTENCIAS",null,null,"RESPONSABLE"]
[{"$nulls":3},"CANT.","P.U.","P.T.","CANT.","P.U.","P.T.","CANT.","P.U.","P.T."]
[{"$nulls":9},8,{"v":60,"d":"$60.00"},{"v":480,"d":"$480.00"}]
[]
["2010-02-01",null,"SITUACIÓN INICIAL",8,{"v":60,"d":"$60.00"},{"$f":"$D$12*$E$12","v":{"v":480,"d":"$480.00"}},{"$nulls":3},{"$f":"J13+D12","v":8},{"$f":"$L$12/$J$12","v":{"v":60,"d":"$60.00"}},{"$f":"L13+F12","v":{"v":480,"d":"$480.00"}}]

{"sheet":"M12","index":13,"n_rows":12,"n_cols":13,"rows_kept":12,"merged":[[0,0,0,12],[2,0,2,12],[5,6,5,7],[7,0,8,0],[7,1,8,1],[7,2,8,2],[7,3,7,5],[7,6,7,8],[7,9,7,11],[7,12,8,12]]}
["RESTAURANTE CAMINOS DE HERRADURA"]
[]
["KARDEX"]
[]
["Artículo:",{"$f":"'MATERIA PRIMA Y MATERIALES'!E21","v":"OLLAS CON TAPAS PEQUEÑAS"},null,null,"Unidad de medida:",null,"UNIDADES",null,"Codigo:",{"$f":"'MATERIA PRIMA Y MATERIALES'!D21","v":"1.1.04.12"}]
[{"$nulls":4},"Fecha de Corte:",null,{"$f":"NOW()","v":"2010-06-10T17:05:11.150"}]
[]
["FECHA","ORDEN DE \nPRODUCCIÓN","DETALLE",{"$nulls":6},"EXISTENCIAS",null,null,"RESPONSABLE"]
[{"$nulls":3},"CANT.","P.U.","P.T.","CANT.","P.U.","P.T.","CANT.","P.U.","P.T."]
[{"$nulls":9},10,{"v":30,"d":"$30.00"},{"v":300,"d":"$300.00"}]
[]
["2010-02-01",null,"SITUACIÓN INICIAL",10,{"v":30,"d":"$30.00"},{"$f":"$D$12*$E$12","v":{"v":300,"d":"$300.00"}},{"$nulls":3},{"$f":"J13+D12","v":10},{"$f":"$L$12/$J$12","v":{"v":30,"d":"$30.00"}},{"$f":"L13+F12","v":{"v":300,"d":"$300.00"}}]

{"sheet":"M13","index":14,"n_rows":12,"n_cols":13,"rows_kept":12,"merged":[[0,0,0,12],[2,0,2,12],[5,6,5,7],[7,0,8,0],[7,1,8,1],[7,2,8,2],[7,3,7,5],[7,6,7,8],[7,9,7,11],[7,12,8,12]]}
["RESTAURANTE CAMINOS DE HERRADURA"]
[]
["KARDEX"]
[]
["Artículo:",{"$f":"'MATERIA PRIMA Y MATERIALES'!E22","v":"VALDES"},null,null,"Unidad de medida:",null,"UNIDADES",null,"Codigo:",{"$f":"'MATERIA PRIMA Y MATERIALES'!D22","v":"1.1.04.13"}]
[{"$nulls":4},"Fecha de Corte:",null,{"$f":"NOW()","v":"2010-06-10T17:05:11.150"}]
[]
["FECHA","ORDEN DE \nPRODUCCIÓN","DETALLE",{"$nulls":6},"EXISTENCIAS",null,null,"RESPONSABLE"]
[{"$nulls":3},"CANT.","P.U.","P.T.","CANT.","P.U.","P.T.","CANT.","P.U.","P.T."]
[{"$nulls":9},4,{"v":4,"d":"$4.00"},{"v":16,"d":"$16.00"}]
[]
["2010-02-01",null,"SITUACIÓN INICIAL",4,{"v":4,"d":"$4.00"},{"$f":"$D$12*$E$12","v":{"v":16,"d":"$16.00"}},{"$nulls":3},{"$f":"J13+D12","v":4},{"$f":"$L$12/$J$12","v":{"v":4,"d":"$4.00"}},{"$f":"L13+F12","v":{"v":16,"d":"$16.00"}}]

{"sheet":"M14","index":15,"n_rows":12,"n_cols":13,"rows_kept":12,"merged":[[0,0,0,12],[2,0,2,12],[5,6,5,7],[7,0,8,0],[7,1,8,1],[7,2,8,2],[7,3,7,5],[7,6,7,8],[7,9,7,11],[7,12,8,12]]}
["RESTAURANTE CAMINOS DE HERRADURA"]
[]
["KARDEX"]
[]
["Artículo:",{"$f":"'MATERIA PRIMA Y MATERIALES'!E23","v":"PAILA"},null,null,"Unidad de medida:",null,"UNIDADES",null,"Codigo:",{"$f":"'MATERIA PRIMA Y MATERIALES'!D23","v":"1.1.04.14"}]
[{"$nulls":4},"Fecha de Corte:",null,{"$f":"NOW()","v":"2010-06-10T17:05:11.150"}]
[]
["FECHA","ORDEN DE \nPRODUCCIÓN","DETALLE",{"$nulls":6},"EXISTENCIAS",null,null,"RESPONSABLE"]
[{"$nulls":3},"CANT.","P.U.","P.T.","CANT.","P.U.","P.T.","CANT.","P.U.","P.T."]
[{"$nulls":9},5,{"v":80,"d":"$80.00"},{"v":400,"d":"$400.00"}]
[]
["2010-02-01",null,"SITUACIÓN INICIAL",5,{"v":80,"d":"$80.00"},{"$f":"$D$12*$E$12","v":{"v":400,"d":"$400.00"}},{"$nulls":3},{"$f":"J13+D12","v":5},{"$f":"$L$12/$J$12","v":{"v":80,"d":"$80.00"}},{"$f":"L13+F12","v":{"v":400,"d":"$400.00"}}]

{"sheet":"M15","index":16,"n_rows":12,"n_cols":13,"rows_kept":12,"merged":[[0,0,0,12],[2,0,2,12],[5,6,5,7],[7,0,8,0],[7,1,8,1],[7,2,8,2],[7,3,7,5],[7,6,7,8],[7,9,7,11],[7,12,8,12]]}
["RESTAURANTE CAMINOS DE HERRADURA"]
[]
["KARDEX"]
[]
["Artículo:",{"$f":"'MATERIA PRIMA Y MATERIALES'!E24","v":"LICUADORA INDUSTRIAL"},null,null,"Unidad de medida:",null,"UNIDADES",null,"Codigo:",{"$f":"'MATERIA PRIMA Y MATERIALES'!D24","v":"1.1.04.15"}]
[{"$nulls":4},"Fecha de Corte:",null,{"$f":"NOW()","v":"2010-06-10T17:05:11.150"}]
[]
["FECHA","ORDEN DE \nPRODUCCIÓN","DETALLE",{"$nulls":6},"EXISTENCIAS",null,null,"RESPONSABLE"]
[{"$nulls":3},"CANT.","P.U.","P.T.","CANT.","P.U.","P.T.","CANT.","P.U.","P.T."]
[{"$nulls":9},1,{"v":500,"d":"$500.00"},{"v":500,"d":"$500.00"}]
[]
["2010-02-01",null,"SITUACIÓN INICIAL",1,{"v":500,"d":"$500.00"},{"$f":"$D$12*$E$12","v":{"v":500,"d":"$500.00"}},{"$nulls":3},{"$f":"J13+D12","v":1},{"$f":"$L$12/$J$12","v":{"v":500,"d":"$500.00"}},{"$f":"L13+F12","v":{"v":500,"d":"$500.00"}}]

{"sheet":"M16","index":17,"n_rows":12,"n_cols":13,"rows_kept":12,"merged":[[0,0,0,12],[2,0,2,12],[5,6,5,7],[7,0,8,0],[7,1,8,1],[7,2,8,2],[7,3,7,5],[7,6,7,8],[7,9,7,11],[7,12,8,12]]}
["RESTAURANTE CAMINOS DE HERRADURA"]
[]
["KARDEX"]
[]
["Artículo:",{"$f":"'MATERIA PRIMA Y MATERIALES'!E25","v":"LICUADORA OSTER"},null,null,"Unidad de medida:",null,"UNIDADES",null,"Codigo:",{"$f":"'MATERIA PRIMA Y MATERIALES'!D25","v":"1.1.04.16"}]
[{"$nulls":4},"Fecha de Corte:",null,{"$f":"NOW()","v":"2010-06-10T17:05:11.150"}]
[]
["FECHA","ORDEN DE \nPRODUCCIÓN","DETALLE",{"$nulls":6},"EXISTENCIAS",null,null,"RESPONSABLE"]
[{"$nulls":3},"CANT.","P.U.","P.T.","CANT.","P.U.","P.T.","CANT.","P.U.","P.T."]
[{"$nulls":9},1,{"v":60,"d":"$60.00"},{"v":60,"d":"$60.00"}]
[]
["2010-02-01",null,"SITUACIÓN INICIAL",1,{"v":60,"d":"$60.00"},{"$f":"$D$12*$E$12","v":{"v":60,"d":"$60.00"}},{"$nulls":3},{"$f":"J13+D12","v":1},{"$f":"$L$12/$J$12","v":{"v":60,"d":"$60.00"}},{"$f":"L13+F12","v":{"v":60,"d":"$60.00"}}]

{"sheet":"M17","index":18,"n_rows":12,"n_cols":13,"rows_kept":12,"merged":[[0,0,0,12],[2,0,2,12],[5,6,5,7],[7,0,8,0],[7,1,8,1],[7,2,8,2],[7,3,7,5],[7,6,7,8],[7,9,7,11],[7,12,8,12]]}
["RESTAURANTE CAMINOS DE HERRADURA"]
[]
["KARDEX"]
[]
["Artículo:",{"$f":"'MATERIA PRIMA Y MATERIALES'!E26","v":"FREIDORES"},null,null,"Unidad de medida:",null,"UNIDADES",null,"Codigo:",{"$f":"'MATERIA PRIMA Y MATERIALES'!D26","v":"1.1.04.17"}]
[{"$nulls":4},"Fecha de Corte:",null,{"$f":"NOW()","v":"2010-06-10T17:05:11.150"}]
[]
["FECHA","ORDEN DE \nPRODUCCIÓN","DETALLE",{"$nulls":6},"EXISTENCIAS",null,null,"RESPONSABLE"]
[{"$nulls":3},"CANT.","P.U.","P.T.","CANT.","P.U.","P.T.","CANT.","P.U.","P.T."]
[{"$nulls":9},6,{"v":4.5,"d":"$4.50"},{"v":27,"d":"$27.00"}]
[]
["2010-02-01",null,"SITUACIÓN INICIAL",6,{"v":4.5,"d":"$4.50"},{"$f":"$D$12*$E$12","v":{"v":27,"d":"$27.00"}},{"$nulls":3},{"$f":"J13+D12","v":6},{"$f":"$L$12/$J$12","v":{"v":4.5,"d":"$4.50"}},{"$f":"L13+F12","v":{"v":27,"d":"$27.00"}}]

{"sheet":"M18","index":19,"n_rows":12,"n_cols":13,"rows_kept":12,"merged":[[0,0,0,12],[2,0,2,12],[5,6,5,7],[7,0,8,0],[7,1,8,1],[7,2,8,2],[7,3,7,5],[7,6,7,8],[7,9,7,11],[7,12,8,12]]}
["RESTAURANTE CAMINOS DE HERRADURA"]
[]
["KARDEX"]
[]
["Artículo:",{"$f":"'MATERIA PRIMA Y MATERIALES'!E27","v":"REFRIGERADORA MABE"},null,null,"Unidad de medida:",null,"UNIDADES",null,"Codigo:",{"$f":"'MATERIA PRIMA Y MATERIALES'!D27","v":"1.1.04.18"}]
[{"$nulls":4},"Fecha de Corte:",null,{"$f":"NOW()","v":"2010-06-10T17:05:11.150"}]
[]
["FECHA","ORDEN DE \nPRODUCCIÓN","DETALLE",{"$nulls":6},"EXISTENCIAS",null,null,"RESPONSABLE"]
[{"$nulls":3},"CANT.","P.U.","P.T.","CANT.","P.U.","P.T.","CANT.","P.U.","P.T."]
[{"$nulls":9},1,{"v":600,"d":"$600.00"},{"v":600,"d":"$600.00"}]
[]
["2010-02-01",null,"SITUACIÓN INICIAL",1,{"v":600,"d":"$600.00"},{"$f":"$D$12*$E$12","v":{"v":600,"d":"$600.00"}},{"$nulls":3},{"$f":"J13+D12","v":1},{"$f":"$L$12/$J$12","v":{"v":600,"d":"$600.00"}},{"$f":"L13+F12","v":{"v":600,"d":"$600.00"}}]

{"sheet":"M19","index":20,"n_rows":12,"n_cols":13,"rows_kept":12,"merged":[[0,0,0,12],[2,0,2,12],[5,6,5,7],[7,0,8,0],[7,1,8,1],[7,2,8,2],[7,3,7,5],[7,6,7,8],[7,9,7,11],[7,12,8,12]]}
["RESTAURANTE CAMINOS DE HERRADURA"]
[]
["KARDEX"]
[]
["Artículo:",{"$f":"'MATERIA PRIMA Y MATERIALES'!E28","v":"DAEWOO"},null,null,"Unidad de medida:",null,"UNIDADES",null,"Codigo:",{"$f":"'MATERIA PRIMA Y MATERIALES'!D28","v":"1.1.04.19"}]
[{"$nulls":4},"Fecha de Corte:",null,{"$f":"NOW()","v":"2010-06-10T17:05:11.150"}]
[]
["FECHA","ORDEN DE \nPRODUCCIÓN","DETALLE",{"$nulls":6},"EXISTENCIAS",null,null,"RESPONSABLE"]
[{"$nulls":3},"CANT.","P.U.","P.T.","CANT.","P.U.","P.T.","CANT.","P.U.","P.T."]
[{"$nulls":9},2,{"v":150,"d":"$150.00"},{"v":300,"d":"$300.00"}]
[]
["2010-02-01",null,"SITUACIÓN INICIAL",2,{"v":150,"d":"$150.00"},{"$f":"$D$12*$E$12","v":{"v":300,"d":"$300.00"}},{"$nulls":3},{"$f":"J13+D12","v":2},{"$f":"$L$12/$J$12","v":{"v":150,"d":"$150.00"}},{"$f":"L13+F12","v":{"v":300,"d":"$300.00"}}]

{"sheet":"M20","index":21,"n_rows":12,"n_cols":13,"rows_kept":12,"merged":[[0,0,0,12],[2,0,2,12],[5,6,5,7],[7,0,8,0],[7,1,8,1],[7,2,8,2],[7,3,7,5],[7,6,7,8],[7,9,7,11],[7,12,8,12]]}
["RESTAURANTE CAMINOS DE HERRADURA"]
[]
["KARDEX"]
[]
["Artículo:",{"$f":"'MATERIA PRIMA Y MATERIALES'!E29","v":"EQUIPO DE SONIDO SONY"},null,null,"Unidad de medida:",null,"UNIDADES",null,"Codigo:",{"$f":"'MATERIA PRIMA Y MATERIALES'!D29","v":"1.1.04.20"}]
[{"$nulls":4},"Fecha de Corte:",null,{"$f":"NOW()","v":"2010-06-10T17:05:11.150"}]
[]
["FECHA","ORDEN DE \nPRODUCCIÓN","DETALLE",{"$nulls":6},"EXISTENCIAS",null,null,"RESPONSABLE"]
[{"$nulls":3},"CANT.","P.U.","P.T.","CANT.","P.U.","P.T.","CANT.","P.U.","P.T."]
[{"$nulls":9},1,{"v":130,"d":"$130.00"},{"v":130,"d":"$130.00"}]
[]
["2010-02-01",null,"SITUACIÓN INICIAL",1,{"v":130,"d":"$130.00"},{"$f":"$D$12*$E$12","v":{"v":130,"d":"$130.00"}},{"$nulls":3},{"$f":"J13+D12","v":1},{"$f":"$L$12/$J$12","v":{"v":130,"d":"$130.00"}},{"$f":"L13+F12","v":{"v":130,"d":"$130.00"}}]

{"sheet":"M21","index":22,"n_rows":12,"n_cols":13,"rows_kept":12,"merged":[[0,0,0,12],[2,0,2,12],[5,6,5,7],[7,0,8,0],[7,1,8,1],[7,2,8,2],[7,3,7,5],[7,6,7,8],[7,9,7,11],[7,12,8,12]]}
["RESTAURANTE CAMINOS DE HERRADURA"]
[]
["KARDEX"]
[]
["Artículo:",{"$f":"'MATERIA PRIMA Y MATERIALES'!E30","v":"MESAS  2 METROS"},null,null,"Unidad de medida:",null,"UNIDADES",null,"Codigo:",{"$f":"'MATERIA PRIMA Y MATERIALES'!D30","v":"1.1.04.21"}]
[{"$nulls":4},"Fecha de Corte:",null,{"$f":"NOW()","v":"2010-06-10T17:05:11.150"}]
[]
["FECHA","ORDEN DE \nPRODUCCIÓN","DETALLE",{"$nulls":6},"EXISTENCIAS",null,null,"RESPONSABLE"]
[{"$nulls":3},"CANT.","P.U.","P.T.","CANT.","P.U.","P.T.","CANT.","P.U.","P.T."]
[{"$nulls":9},28,{"v":60,"d":"$60.00"},{"v":1680,"d":"$1,680.00"}]
[]
["2010-02-01",null,"SITUACIÓN INICIAL",28,{"v":60,"d":"$60.00"},{"$f":"$D$12*$E$12","v":{"v":1680,"d":"$1,680.00"}},{"$nulls":3},{"$f":"J13+D12","v":28},{"$f":"$L$12/$J$12","v":{"v":60,"d":"$60.00"}},{"$f":"L13+F12","v":{"v":1680,"d":"$1,680.00"}}]

{"sheet":"M22","index":23,"n_rows":12,"n_cols":13,"rows_kept":12,"merged":[[0,0,0,12],[2,0,2,12],[5,6,5,7],[7,0,8,0],[7,1,8,1],[7,2,8,2],[7,3,7,5],[7,6,7,8],[7,9,7,11],[7,12,8,12]]}
["RESTAURANTE CAMINOS DE HERRADURA"]
[]
["KARDEX"]
[]
["Articulo:",{"$f":"'MATERIA PRIMA Y MATERIALES'!E31","v":"MESAS 1 METRO"},null,null,"Unidad de medida:",null,"UNIDADES",null,"Codigo:",{"$f":"'MATERIA PRIMA Y MATERIALES'!D31","v":"1.1.04.22"}]
[{"$nulls":4},"Fecha de Corte:",null,{"$f":"NOW()","v":"2010-06-10T17:05:11.150"}]
[]
["FECHA","ORDEN DE \nPRODUCCIÓN","DETALLE",{"$nulls":6},"EXISTENCIAS",null,null,"RESPONSABLE"]
[{"$nulls":3},"CANT.","P.U.","P.T.","CANT.","P.U.","P.T.","CANT.","P.U.","P.T."]
[{"$nulls":9},10,{"v":40,"d":"$40.00"},{"v":400,"d":"$400.00"}]
[]
["2010-02-01",null,"SITUACIÓN INICIAL",10,{"v":40,"d":"$40.00"},{"$f":"$D$12*$E$12","v":{"v":400,"d":"$400.00"}},{"$nulls":3},{"$f":"J13+D12","v":10},{"$f":"$L$12/$J$12","v":{"v":40,"d":"$40.00"}},{"$f":"L13+F12","v":{"v":400,"d":"$400.00"}}]

{"sheet":"M23","index":24,"n_rows":12,"n_cols":13,"rows_kept":12,"merged":[[0,0,0,12],[2,0,2,12],[5,6,5,7],[7,0,8,0],[7,1,8,1],[7,2,8,2],[7,3,7,5],[7,6,7,8],[7,9,7,11],[7,12,8,12]]}
["RESTAURANTE CAMINOS DE HERRADURA"]
[]
["KARDEX"]
[]
["Artículo:",{"$f":"'MATERIA PRIMA Y MATERIALES'!E32","v":"SILLAS NEGRAS"},null,null,"Unidad de medida:",null,"UNIDADES",null,"Codigo:",{"$f":"'MATERIA PRIMA Y MATERIALES'!D32","v":"1.1.04.23"}]
[{"$nulls":4},"Fecha de Corte:",null,{"$f":"NOW()","v":"2010-06-10T17:05:11.150"}]
[]
["FECHA","ORDEN DE \nPRODUCCIÓN","DETALLE",{"$nulls":6},"EXISTENCIAS",null,null,"RESPONSABLE"]
[{"$nulls":3},"CANT.","P.U.","P.T.","CANT.","P.U.","P.T.","CANT.","P.U.","P.T."]
[{"$nulls":9},300,{"v":13,"d":"$13.00"},{"v":3900,"d":"$3,900.00"}]
[]
["2010-02-01",null,"SITUACIÓN  INICIAL",300,{"v":13,"d":"$13.00"},{"$f":"$D$12*$E$12","v":{"v":3900,"d":"$3,900.00"}},{"$nulls":3},{"$f":"J13+D12","v":300},{"$f":"$L$12/$J$12","v":{"v":13,"d":"$13.00"}},{"$f":"L13+F12","v":{"v":3900,"d":"$3,900.00"}}]

{"sheet":"M24","index":25,"n_rows":12,"n_cols":13,"rows_kept":12,"merged":[[0,0,0,12],[2,0,2,12],[5,6,5,7],[7,0,8,0],[7,1,8,1],[7,2,8,2],[7,3,7,5],[7,6,7,8],[7,9,7,11],[7,12,8,12]]}
["RESTAURANTE CAMINOS DE HERRADURA"]
[]
["KARDEX"]
[]
["Artículo:",{"$f":"'MATERIA PRIMA Y MATERIALES'!E33","v":"MANTELES MANTECA  M/2m"},null,null,"Unidad de medida:",null,"UNIDADES",null,"Codigo:",{"$f":"'MATERIA PRIMA Y MATERIALES'!D33","v":"1.1.04.24"}]
[{"$nulls":4},"Fecha de Corte:",null,{"$f":"NOW()","v":"2010-06-10T17:05:11.150"}]
[]
["FECHA","ORDEN DE \nPRODUCCIÓN","DETALLE",{"$nulls":6},"EXISTENCIAS",null,null,"RESPONSABLE"]
[{"$nulls":3},"CANT.","P.U.","P.T.","CANT.","P.U.","P.T.","CANT.","P.U.","P.T."]
[{"$nulls":9},48,{"v":15,"d":"$15.00"},{"v":720,"d":"$720.00"}]
[]
["2010-02-01",null,"SITUACIÓN INICIAL",48,{"v":15,"d":"$15.00"},{"$f":"$D$12*$E$12","v":{"v":720,"d":"$720.00"}},{"$nulls":3},{"$f":"J13+D12","v":48},{"$f":"$L$12/$J$12","v":{"v":15,"d":"$15.00"}},{"$f":"L13+F12","v":{"v":720,"d":"$720.00"}}]

{"sheet":"M25","index":26,"n_rows":12,"n_cols":13,"rows_kept":12,"merged":[[0,0,0,12],[2,0,2,12],[5,6,5,7],[7,0,8,0],[7,1,8,1],[7,2,8,2],[7,3,7,5],[7,6,7,8],[7,9,7,11],[7,12,8,12]]}
["RESTAURANTE CAMINOS DE HERRADURA"]
[]
["KARDEX"]
[]
["Artículo:",{"$f":"'MATERIA PRIMA Y MATERIALES'!E34","v":"SOBREMANTELES AMARILLOS"},null,null,"Unidad de medida:",null,"UNIDADES",null,"Codigo:",{"$f":"'MATERIA PRIMA Y MATERIALES'!D34","v":"1.1.04.25"}]
[{"$nulls":4},"Fecha de Corte:",null,{"$f":"NOW()","v":"2010-06-10T17:05:11.150"}]
[]
["FECHA","ORDEN DE \nPRODUCCIÓN","DETALLE",{"$nulls":6},"EXISTENCIAS",null,null,"RESPONSABLE"]
[{"$nulls":3},"CANT.","P.U.","P.T.","CANT.","P.U.","P.T.","CANT.","P.U.","P.T."]
[{"$nulls":9},30,{"v":3,"d":"$3.00"},{"v":90,"d":"$90.00"}]
[]
["2010-02-01",null,"SITUACIÓN INICIAL",30,{"v":3,"d":"$3.00"},{"$f":"$D$12*$E$12","v":{"v":90,"d":"$90.00"}},{"$nulls":3},{"$f":"J13+D12","v":30},{"$f":"$L$12/$J$12","v":{"v":3,"d":"$3.00"}},{"$f":"L13+F12","v":{"v":90,"d":"$90.00"}}]

{"sheet":"M26","index":27,"n_rows":12,"n_cols":13,"rows_kept":12,"merged":[[0,0,0,12],[2,0,2,12],[5,6,5,7],[7,0,8,0],[7,1,8,1],[7,2,8,2],[7,3,7,5],[7,6,7,8],[7,9,7,11],[7,12,8,12]]}
["RESTAURANTE CAMINOS DE HERRADURA"]
[]
["KARDEX"]
[]
["Artículo:",{"$f":"'MATERIA PRIMA Y MATERIALES'!E35","v":"SOBREMANTELES ROJOS"},null,null,"Unidad de medida:",null,"UNIDADES",null,"Codigo:",{"$f":"'MATERIA PRIMA Y MATERIALES'!D35","v":"1.1.04.26"}]
[{"$nulls":4},"Fecha de Corte:",null,{"$f":"NOW()","v":"2010-06-10T17:05:11.150"}]
[]
["FECHA","ORDEN DE \nPRODUCCIÓN","DETALLE",{"$nulls":6},"EXISTENCIAS",null,null,"RESPONSABLE"]
[{"$nulls":3},"CANT.","P.U.","P.T.","CANT.","P.U.","P.T.","CANT.","P.U.","P.T."]
[{"$nulls":9},30,{"v":3,"d":"$3.00"},{"v":90,"d":"$90.00"}]
[]
["2010-02-01",null,"SITUACIÓN INICIAL",30,{"v":3,"d":"$3.00"},{"$f":"$D$12*$E$12","v":{"v":90,"d":"$90.00"}},{"$nulls":3},{"$f":"J13+D12","v":30},{"$f":"$L$12/$J$12","v":{"v":3,"d":"$3.00"}},{"$f":"L13+F12","v":{"v":90,"d":"$90.00"}}]

{"sheet":"M27","index":28,"n_rows":12,"n_cols":13,"rows_kept":12,"merged":[[0,0,0,12],[2,0,2,12],[5,6,5,7],[7,0,8,0],[7,1,8,1],[7,2,8,2],[7,3,7,5],[7,6,7,8],[7,9,7,11],[7,12,8,12]]}
["RESTAURANTE CAMINOS DE HERRADURA"]
[]
["KARDEX"]
[]
["Artículo:",{"$f":"'MATERIA PRIMA Y MATERIALES'!E36","v":"SOBREMANTELES DORADOS"},null,null,"Unidad de medida:",null,"UNIDADES",null,"Codigo:",{"$f":"'MATERIA PRIMA Y MATERIALES'!D36","v":"1.1.04.27"}]
[{"$nulls":4},"Fecha de Corte:",null,{"$f":"NOW()","v":"2010-06-10T17:05:11.150"}]
[]
["FECHA","ORDEN DE \nPRODUCCIÓN","DETALLE",{"$nulls":6},"EXISTENCIAS",null,null,"RESPONSABLE"]
[{"$nulls":3},"CANT.","P.U.","P.T.","CANT.","P.U.","P.T.","CANT.","P.U.","P.T."]
[{"$nulls":9},30,{"v":3,"d":"$3.00"},{"v":90,"d":"$90.00"}]
[]
["2010-02-01",null,"SITUACIÓN INICIAL",30,{"v":3,"d":"$3.00"},{"$f":"$D$12*$E$12","v":{"v":90,"d":"$90.00"}},{"$nulls":3},{"$f":"J13+D12","v":30},{"$f":"$L$12/$J$12","v":{"v":3,"d":"$3.00"}},{"$f":"L13+F12","v":{"v":90,"d":"$90.00"}}]

{"sheet":"M28","index":29,"n_rows":12,"n_cols":13,"rows_kept":12,"merged":[[0,0,0,12],[2,0,2,12],[5,6,5,7],[7,0,8,0],[7,1,8,1],[7,2,8,2],[7,3,7,5],[7,6,7,8],[7,9,7,11],[7,12,8,12]]}
["RESTAURANTE CAMINOS DE HERRADURA"]
[]
["KARDEX"]
[]
["Artículo:",{"$f":"'MATERIA PRIMA Y MATERIALES'!E37","v":"SOBREMANTELES ROSADOS"},null,null,"Unidad de medida:",null,"UNIDADES",null,"Codigo:",{"$f":"'MATERIA PRIMA Y MATERIALES'!D37","v":"1.1.04.28"}]
[{"$nulls":4},"Fecha de Corte:",null,{"$f":"NOW()","v":"2010-06-10T17:05:11.150"}]
[]
["FECHA","ORDEN DE \nPRODUCCIÓN","DETALLE",{"$nulls":6},"EXISTENCIAS",null,null,"RESPONSABLE"]
[{"$nulls":3},"CANT.","P.U.","P.T.","CANT.","P.U.","P.T.","CANT.","P.U.","P.T."]
[{"$nulls":9},25,{"v":3,"d":"$3.00"},{"v":75,"d":"$75.00"}]
[]
["2010-02-01",null,"SITUACIÓN INICIAL",25,{"v":3,"d":"$3.00"},{"$f":"$D$12*$E$12","v":{"v":75,"d":"$75.00"}},{"$nulls":3},{"$f":"J13+D12","v":25},{"$f":"$L$12/$J$12","v":{"v":3,"d":"$3.00"}},{"$f":"L13+F12","v":{"v":75,"d":"$75.00"}}]

{"sheet":"M29","index":30,"n_rows":12,"n_cols":13,"rows_kept":12,"merged":[[0,0,0,12],[2,0,2,12],[5,6,5,7],[7,0,8,0],[7,1,8,1],[7,2,8,2],[7,3,7,5],[7,6,7,8],[7,9,7,11],[7,12,8,12]]}
["RESTAURANTE CAMINOS DE HERRADURA"]
[]
["KARDEX"]
[]
["Artículo:",{"$f":"'MATERIA PRIMA Y MATERIALES'!E38","v":"MANTELES COLORES M/1m"},null,null,"Unidad de medida:",null,"UNIDADES",null,"Codigo:",{"$f":"'MATERIA PRIMA Y MATERIALES'!D38","v":"1.1.04.29"}]
[{"$nulls":4},"Fecha de Corte:",null,{"$f":"NOW()","v":"2010-06-10T17:05:11.150"}]
[]
["FECHA","ORDEN DE \nPRODUCCIÓN","DETALLE",{"$nulls":6},"EXISTENCIAS",null,null,"RESPONSABLE"]
[{"$nulls":3},"CANT.","P.U.","P.T.","CANT.","P.U.","P.T.","CANT.","P.U.","P.T."]
[{"$nulls":9},10,{"v":6,"d":"$6.00"},{"v":60,"d":"$60.00"}]
[]
["2010-02-01",null,"SITUACIÓN INICIAL",10,{"v":6,"d":"$6.00"},{"$f":"$D$12*$E$12","v":{"v":60,"d":"$60.00"}},{"$nulls":3},{"$f":"J13+D12","v":10},{"$f":"$L$12/$J$12","v":{"v":6,"d":"$6.00"}},{"$f":"L13+F12","v":{"v":60,"d":"$60.00"}}]

{"sheet":"M30","index":31,"n_rows":12,"n_cols":13,"rows_kept":12,"merged":[[0,0,0,12],[2,0,2,12],[5,6,5,7],[7,0,8,0],[7,1,8,1],[7,2,8,2],[7,3,7,5],[7,6,7,8],[7,9,7,11],[7,12,8,12]]}
["RESTAURANTE CAMINOS DE HERRADURA"]
[]
["KARDEX"]
[]
["Artículo:",{"$f":"'MATERIA PRIMA Y MATERIALES'!E39","v":"VIDRIOS  M/1m"},null,null,"Unidad de medida:",null,"UNIDADES",null,"Codigo:",{"$f":"'MATERIA PRIMA Y MATERIALES'!D39","v":"1.1.04.30"}]
[{"$nulls":4},"Fecha de Corte:",null,{"$f":"NOW()","v":"2010-06-10T17:05:11.150"}]
[]
["FECHA","ORDEN DE \nPRODUCCIÓN","DETALLE",{"$nulls":6},"EXISTENCIAS",null,null,"RESPONSABLE"]
[{"$nulls":3},"CANT.","P.U.","P.T.","CANT.","P.U.","P.T.","CANT.","P.U.","P.T."]
[{"$nulls":9},10,{"v":10,"d":"$10.00"},{"v":100,"d":"$100.00"}]
[]
["2010-02-01",null,"SITUACIÓN INICIAL",10,{"v":10,"d":"$10.00"},{"$f":"$D$12*$E$12","v":{"v":100,"d":"$100.00"}},{"$nulls":3},{"$f":"J13+D12","v":10},{"$f":"$L$12/$J$12","v":{"v":10,"d":"$10.00"}},{"$f":"L13+F12","v":{"v":100,"d":"$100.00"}}]

{"sheet":"M31","index":32,"n_rows":12,"n_cols":13,"rows_kept":12,"merged":[[0,0,0,12],[2,0,2,12],[5,6,5,7],[7,0,8,0],[7,1,8,1],[7,2,8,2],[7,3,7,5],[7,6,7,8],[7,9,7,11],[7,12,8,12]]}
["RESTAURANTE CAMINOS DE HERRADURA"]
[]
["KARDEX"]
[]
["Artículo:",{"$f":"'MATERIA PRIMA Y MATERIALES'!E40","v":"SALEROS"},null,null,"Unidad de medida:",null,"UNIDADES",null,"Codigo:",{"$f":"'MATERIA PRIMA Y MATERIALES'!D40","v":"1.1.04.31"}]
[{"$nulls":4},"Fecha de Corte:",null,{"$f":"NOW()","v":"2010-06-10T17:05:11.150"}]
[]
["FECHA","ORDEN DE \nPRODUCCIÓN","DETALLE",{"$nulls":6},"EXISTENCIAS",null,null,"RESPONSABLE"]
[{"$nulls":3},"CANT.","P.U.","P.T.","CANT.","P.U.","P.T.","CANT.","P.U.","P.T."]
[{"$nulls":9},15,{"v":0.3,"d":"$0.30"},{"v":4.5,"d":"$4.50"}]
[]
["2010-02-01",null,"SITUACIÓN INICIAL",15,{"v":0.3,"d":"$0.30"},{"$f":"$D$12*$E$12","v":{"v":4.5,"d":"$4.50"}},{"$nulls":3},{"$f":"J13+D12","v":15},{"$f":"$L$12/$J$12","v":{"v":0.3,"d":"$0.30"}},{"$f":"L13+F12","v":{"v":4.5,"d":"$4.50"}}]

{"sheet":"M32","index":33,"n_rows":12,"n_cols":13,"rows_kept":12,"merged":[[0,0,0,12],[2,0,2,12],[5,6,5,7],[7,0,8,0],[7,1,8,1],[7,2,8,2],[7,3,7,5],[7,6,7,8],[7,9,7,11],[7,12,8,12]]}
["RESTAURANTE CAMINOS DE HERRADURA"]
[]
["KARDEX"]
[]
["Artículo:",{"$f":"'MATERIA PRIMA Y MATERIALES'!E41","v":"CAJAS PARA CUBIERTOS "},null,null,"Unidad de medida:",null,"UNIDADES",null,"Codigo:",{"$f":"'MATERIA PRIMA Y MATERIALES'!D41","v":"1.1.04.32"}]
[{"$nulls":4},"Fecha de Corte:",null,{"$f":"NOW()","v":"2010-06-10T17:05:11.150"}]
[]
["FECHA","ORDEN DE \nPRODUCCIÓN","DETALLE",{"$nulls":6},"EXISTENCIAS",null,null,"RESPONSABLE"]
[{"$nulls":3},"CANT.","P.U.","P.T.","CANT.","P.U.","P.T.","CANT.","P.U.","P.T."]
[{"$nulls":9},14,{"v":1,"d":"$1.00"},{"v":14,"d":"$14.00"}]
[]
["2010-02-01",null,"SITUACIÍN INICIAL",14,{"v":1,"d":"$1.00"},{"$f":"$D$12*$E$12","v":{"v":14,"d":"$14.00"}},{"$nulls":3},{"$f":"J13+D12","v":14},{"$f":"$L$12/$J$12","v":{"v":1,"d":"$1.00"}},{"$f":"L13+F12","v":{"v":14,"d":"$14.00"}}]

{"sheet":"M33","index":34,"n_rows":12,"n_cols":13,"rows_kept":12,"merged":[[0,0,0,12],[2,0,2,12],[5,6,5,7],[7,0,8,0],[7,1,8,1],[7,2,8,2],[7,3,7,5],[7,6,7,8],[7,9,7,11],[7,12,8,12]]}
["RESTAURANTE CAMINOS DE HERRADURA"]
[]
["KARDEX"]
[]
["Artículo:",{"$f":"'MATERIA PRIMA Y MATERIALES'!E42","v":"BAR"},null,null,"Unidad de medida:",null,"UNIDADES",null,"Codigo:",{"$f":"'MATERIA PRIMA Y MATERIALES'!D42","v":"1.1.04.33"}]
[{"$nulls":4},"Fecha de Corte:",null,{"$f":"NOW()","v":"2010-06-10T17:05:11.150"}]
[]
["FECHA","ORDEN DE \nPRODUCCIÓN","DETALLE",{"$nulls":6},"EXISTENCIAS",null,null,"RESPONSABLE"]
[{"$nulls":3},"CANT.","P.U.","P.T.","CANT.","P.U.","P.T.","CANT.","P.U.","P.T."]
[{"$nulls":9},1,{"v":150,"d":"$150.00"},{"v":150,"d":"$150.00"}]
[]
["2010-02-01",null,"SITUACIÓN INICIAL ",1,{"v":150,"d":"$150.00"},{"$f":"$D$12*$E$12","v":{"v":150,"d":"$150.00"}},{"$nulls":3},{"$f":"J13+D12","v":1},{"$f":"$L$12/$J$12","v":{"v":150,"d":"$150.00"}},{"$f":"L13+F12","v":{"v":150,"d":"$150.00"}}]

{"sheet":"M34","index":35,"n_rows":12,"n_cols":13,"rows_kept":12,"merged":[[0,0,0,12],[2,0,2,12],[5,6,5,7],[7,0,8,0],[7,1,8,1],[7,2,8,2],[7,3,7,5],[7,6,7,8],[7,9,7,11],[7,12,8,12]]}
["RESTAURANTE CAMINOS DE HERRADURA"]
[]
["KARDEX"]
[]
["Artículo:",{"$f":"'MATERIA PRIMA Y MATERIALES'!E43","v":"CUCHARAS"},null,null,"Unidad de medida:",null,"UNIDADES",null,"Codigo:",{"$f":"'MATERIA PRIMA Y MATERIALES'!D43","v":"1.1.04.34"}]
[{"$nulls":4},"Fecha de Corte:",null,{"$f":"NOW()","v":"2010-06-10T17:05:11.150"}]
[]
["FECHA","ORDEN DE \nPRODUCCIÓN","DETALLE",{"$nulls":6},"EXISTENCIAS",null,null,"RESPONSABLE"]
[{"$nulls":3},"CANT.","P.U.","P.T.","CANT.","P.U.","P.T.","CANT.","P.U.","P.T."]
[{"$nulls":9},300,{"v":0.35,"d":"$0.35"},{"v":105,"d":"$105.00"}]
[]
["2010-02-01",null,"SITUACIÓN INICIAL",300,{"v":0.35,"d":"$0.35"},{"$f":"$D$12*$E$12","v":{"v":105,"d":"$105.00"}},{"$nulls":3},{"$f":"J13+D12","v":300},{"$f":"$L$12/$J$12","v":{"v":0.35,"d":"$0.35"}},{"$f":"L13+F12","v":{"v":105,"d":"$105.00"}}]

{"sheet":"M35","index":36,"n_rows":12,"n_cols":13,"rows_kept":12,"merged":[[0,0,0,12],[2,0,2,12],[5,6,5,7],[7,0,8,0],[7,1,8,1],[7,2,8,2],[7,3,7,5],[7,6,7,8],[7,9,7,11],[7,12,8,12]]}
["RESTAURANTE CAMINOS DE HERRADURA"]
[]
["KARDEX"]
[]
["Artículo:",{"$f":"'MATERIA PRIMA Y MATERIALES'!E44","v":"CUCHILLOS DE MESA"},null,null,"Unidad de medida:",null,"UNIDADES",null,"Codigo:",{"$f":"'MATERIA PRIMA Y MATERIALES'!D44","v":"1.1.04.35"}]
[{"$nulls":4},"Fecha de Corte:",null,{"$f":"NOW()","v":"2010-06-10T17:05:11.150"}]
[]
["FECHA","ORDEN DE \nPRODUCCIÓN","DETALLE",{"$nulls":6},"EXISTENCIAS",null,null,"RESPONSABLE"]
[{"$nulls":3},"CANT.","P.U.","P.T.","CANT.","P.U.","P.T.","CANT.","P.U.","P.T."]
[{"$nulls":9},250,{"v":0.6,"d":"$0.60"},{"v":150,"d":"$150.00"}]
[]
["2010-02-01",null,"SITUACIÓN INICIAL",250,{"v":0.6,"d":"$0.60"},{"$f":"$D$12*$E$12","v":{"v":150,"d":"$150.00"}},{"$nulls":3},{"$f":"J13+D12","v":250},{"$f":"$L$12/$J$12","v":{"v":0.6,"d":"$0.60"}},{"$f":"L13+F12","v":{"v":150,"d":"$150.00"}}]

{"sheet":"M36","index":37,"n_rows":12,"n_cols":13,"rows_kept":12,"merged":[[0,0,0,12],[2,0,2,12],[5,6,5,7],[7,0,8,0],[7,1,8,1],[7,2,8,2],[7,3,7,5],[7,6,7,8],[7,9,7,11],[7,12,8,12]]}
["RESTAURANTE CAMINOS DE HERRADURA"]
[]
["KARDEX"]
[]
["Artículo:",{"$f":"'MATERIA PRIMA Y MATERIALES'!E45","v":"CUHARILLAS"},null,null,"Unidad de medida:",null,"UNIDADES",null,"Codigo:",{"$f":"'MATERIA PRIMA Y MATERIALES'!D45","v":"1.1.04.36"}]
[{"$nulls":4},"Fecha de Corte:",null,{"$f":"NOW()","v":"2010-06-10T17:05:11.150"}]
[]
["FECHA","ORDEN DE \nPRODUCCIÓN","DETALLE",{"$nulls":6},"EXISTENCIAS",null,null,"RESPONSABLE"]
[{"$nulls":3},"CANT.","P.U.","P.T.","CANT.","P.U.","P.T.","CANT.","P.U.","P.T."]
[{"$nulls":9},135,{"v":0.3,"d":"$0.30"},{"v":40.5,"d":"$40.50"}]
[]
["2010-02-01",null,"SITUACIÓN INICIAL",135,{"v":0.3,"d":"$0.30"},{"$f":"$D$12*$E$12","v":{"v":40.5,"d":"$40.50"}},{"$nulls":3},{"$f":"J13+D12","v":135},{"$f":"$L$12/$J$12","v":{"v":0.3,"d":"$0.30"}},{"$f":"L13+F12","v":{"v":40.5,"d":"$40.50"}}]

{"sheet":"M37","index":38,"n_rows":12,"n_cols":13,"rows_kept":12,"merged":[[0,0,0,12],[2,0,2,12],[5,6,5,7],[7,0,8,0],[7,1,8,1],[7,2,8,2],[7,3,7,5],[7,6,7,8],[7,9,7,11],[7,12,8,12]]}
["RESTAURANTE CAMINOS DE HERRADURA"]
[]
["KARDEX"]
[]
["Artículo:",{"$f":"'MATERIA PRIMA Y MATERIALES'!E46","v":"CUCHILLOS DE COCINA"},null,null,"Unidad de medida:",null,"UNIDADES",null,"Codigo:",{"$f":"'MATERIA PRIMA Y MATERIALES'!D46","v":"1.1.04.37"}]
[{"$nulls":4},"Fecha de Corte:",null,{"$f":"NOW()","v":"2010-06-10T17:05:11.150"}]
[]
["FECHA","ORDEN DE \nPRODUCCIÓN","DETALLE",{"$nulls":6},"EXISTENCIAS",null,null,"RESPONSABLE"]
[{"$nulls":3},"CANT.","P.U.","P.T.","CANT.","P.U.","P.T.","CANT.","P.U.","P.T."]
[{"$nulls":9},18,{"v":2.5,"d":"$2.50"},{"v":45,"d":"$45.00"}]
[]
["2010-02-01",null,"SITUACIÓN INICIAL",18,{"v":2.5,"d":"$2.50"},{"$f":"$D$12*$E$12","v":{"v":45,"d":"$45.00"}},{"$nulls":3},{"$f":"J13+D12","v":18},{"$f":"$L$12/$J$12","v":{"v":2.5,"d":"$2.50"}},{"$f":"L13+F12","v":{"v":45,"d":"$45.00"}}]

{"sheet":"M38","index":39,"n_rows":12,"n_cols":13,"rows_kept":12,"merged":[[0,0,0,12],[2,0,2,12],[5,6,5,7],[7,0,8,0],[7,1,8,1],[7,2,8,2],[7,3,7,5],[7,6,7,8],[7,9,7,11],[7,12,8,12]]}
["RESTAURANTE CAMINOS DE HERRADURA"]
[]
["KARDEX"]
[]
["Artículo:",{"$f":"'MATERIA PRIMA Y MATERIALES'!E47","v":"CUCHARETAS"},null,null,"Unidad de medida:",null,"UNIDADES",null,"Codigo:",{"$f":"'MATERIA PRIMA Y MATERIALES'!D47","v":"1.1.04.38"}]
[{"$nulls":4},"Fecha de Corte:",null,{"$f":"NOW()","v":"2010-06-10T17:05:11.150"}]
[]
["FECHA","ORDEN DE \nPRODUCCIÓN","DETALLE",{"$nulls":6},"EXISTENCIAS",null,null,"RESPONSABLE"]
[{"$nulls":3},"CANT.","P.U.","P.T.","CANT.","P.U.","P.T.","CANT.","P.U.","P.T."]
[{"$nulls":9},10,{"v":3.5,"d":"$3.50"},{"v":35,"d":"$35.00"}]
[]
["2010-02-01",null,"SITUACIÓN INICIAL",10,{"v":3.5,"d":"$3.50"},{"$f":"$D$12*$E$12","v":{"v":35,"d":"$35.00"}},{"$nulls":3},{"$f":"J13+D12","v":10},{"$f":"$L$12/$J$12","v":{"v":3.5,"d":"$3.50"}},{"$f":"L13+F12","v":{"v":35,"d":"$35.00"}}]

{"sheet":"M39","index":40,"n_rows":12,"n_cols":13,"rows_kept":12,"merged":[[0,0,0,12],[2,0,2,12],[5,6,5,7],[7,0,8,0],[7,1,8,1],[7,2,8,2],[7,3,7,5],[7,6,7,8],[7,9,7,11],[7,12,8,12]]}
["RESTAURANTE CAMINOS DE HERRADURA"]
[]
["KARDEX"]
[]
["Artículo:",{"$f":"'MATERIA PRIMA Y MATERIALES'!E48","v":"CUCHARONES"},null,null,"Unidad de medida:",null,"UNIDADES",null,"Codigo:",{"$f":"'MATERIA PRIMA Y MATERIALES'!D48","v":"1.1.04.39"}]
[{"$nulls":4},"Fecha de Corte:",null,{"$f":"NOW()","v":"2010-06-10T17:05:11.150"}]
[]
["FECHA","ORDEN DE \nPRODUCCIÓN","DETALLE",{"$nulls":6},"EXISTENCIAS",null,null,"RESPONSABLE"]
[{"$nulls":3},"CANT.","P.U.","P.T.","CANT.","P.U.","P.T.","CANT.","P.U.","P.T."]
[{"$nulls":9},4,{"v":8,"d":"$8.00"},{"v":32,"d":"$32.00"}]
[]
["2010-02-01",null,"SITUACIÓN INICIAIL",4,{"v":8,"d":"$8.00"},{"$f":"$D$12*$E$12","v":{"v":32,"d":"$32.00"}},{"$nulls":3},{"$f":"J13+D12","v":4},{"$f":"$L$12/$J$12","v":{"v":8,"d":"$8.00"}},{"$f":"L13+F12","v":{"v":32,"d":"$32.00"}}]

{"sheet":"M40","index":41,"n_rows":12,"n_cols":13,"rows_kept":12,"merged":[[0,0,0,12],[2,0,2,12],[5,6,5,7],[7,0,8,0],[7,1,8,1],[7,2,8,2],[7,3,7,5],[7,6,7,8],[7,9,7,11],[7,12,8,12]]}
["RESTAURANTE CAMINOS DE HERRADURA"]
[]
["KARDEX"]
[]
["Artículo:",{"$f":"'MATERIA PRIMA Y MATERIALES'!E49","v":"DIABLO"},null,null,"Unidad de medida:",null,"UNIDADES",null,"Codigo:",{"$f":"'MATERIA PRIMA Y MATERIALES'!D49","v":"1.1.04.40"}]
[{"$nulls":4},"Fecha de Corte:",null,{"$f":"NOW()","v":"2010-06-10T17:05:11.150"}]
[]
["FECHA","ORDEN DE \nPRODUCCIÓN","DETALLE",{"$nulls":6},"EXISTENCIAS",null,null,"RESPONSABLE"]
[{"$nulls":3},"CANT.","P.U.","P.T.","CANT.","P.U.","P.T.","CANT.","P.U.","P.T."]
[{"$nulls":9},4,{"v":6,"d":"$6.00"},{"v":24,"d":"$24.00"}]
[]
["2010-02-01",null,"SITUACIÓN INICIAL",4,{"v":6,"d":"$6.00"},{"$f":"$D$12*$E$12","v":{"v":24,"d":"$24.00"}},{"$nulls":3},{"$f":"J13+D12","v":4},{"$f":"$L$12/$J$12","v":{"v":6,"d":"$6.00"}},{"$f":"L13+F12","v":{"v":24,"d":"$24.00"}}]

{"sheet":"M41","index":42,"n_rows":12,"n_cols":13,"rows_kept":12,"merged":[[0,0,0,12],[2,0,2,12],[5,6,5,7],[7,0,8,0],[7,1,8,1],[7,2,8,2],[7,3,7,5],[7,6,7,8],[7,9,7,11],[7,12,8,12]]}
["RESTAURANTE CAMINOS DE HERRADURA"]
[]
["KARDEX"]
[]
["Artículo:",{"$f":"'MATERIA PRIMA Y MATERIALES'!E50","v":"PLATO SOPERO"},null,null,"Unidad de medida:",null,"UNIDADES",null,"Codigo:",{"$f":"'MATERIA PRIMA Y MATERIALES'!D50","v":"1.1.04.41"}]
[{"$nulls":4},"Fecha de Corte:",null,{"$f":"NOW()","v":"2010-06-10T17:05:11.150"}]
[]
["FECHA","ORDEN DE \nPRODUCCIÓN","DETALLE",{"$nulls":6},"EXISTENCIAS",null,null,"RESPONSABLE"]
[{"$nulls":3},"CANT.","P.U.","P.T.","CANT.","P.U.","P.T.","CANT.","P.U.","P.T."]
[{"$nulls":9},240,{"v":0.8,"d":"$0.80"},{"v":192,"d":"$192.00"}]
[]
["2010-02-01",null,"SITUACIÓN INICIAL ",240,{"v":0.8,"d":"$0.80"},{"$f":"$D$12*$E$12","v":{"v":192,"d":"$192.00"}},{"$nulls":3},{"$f":"J13+D12","v":240},{"$f":"$L$12/$J$12","v":{"v":0.8,"d":"$0.80"}},{"$f":"L13+F12","v":{"v":192,"d":"$192.00"}}]

{"sheet":"M42","index":43,"n_rows":12,"n_cols":13,"rows_kept":12,"merged":[[0,0,0,12],[2,0,2,12],[5,6,5,7],[7,0,8,0],[7,1,8,1],[7,2,8,2],[7,3,7,5],[7,6,7,8],[7,9,7,11],[7,12,8,12]]}
["RESTAURANTE CAMINOS DE HERRADURA"]
[]
["KARDEX"]
[]
["Artículo:",{"$f":"'MATERIA PRIMA Y MATERIALES'!E51","v":"PLATO FUERTE"},null,null,"Unidad de medida:",null,"UNIDADES",null,"Codigo:",{"$f":"'MATERIA PRIMA Y MATERIALES'!D51","v":"1.1.04.42"}]
[{"$nulls":4},"Fecha de Corte:",null,{"$f":"NOW()","v":"2010-06-10T17:05:11.150"}]
[]
["FECHA","ORDEN DE \nPRODUCCIÓN","DETALLE",{"$nulls":6},"EXISTENCIAS",null,null,"RESPONSABLE"]
[{"$nulls":3},"CANT.","P.U.","P.T.","CANT.","P.U.","P.T.","CANT.","P.U.","P.T."]
[{"$nulls":9},220,{"v":1.3,"d":"$1.30"},{"v":286,"d":"$286.00"}]
[]
["2010-02-01",null,"SITUACIÓN INICIAL",220,{"v":1.3,"d":"$1.30"},{"$f":"$D$12*$E$12","v":{"v":286,"d":"$286.00"}},{"$nulls":3},{"$f":"J13+D12","v":220},{"$f":"$L$12/$J$12","v":{"v":1.3,"d":"$1.30"}},{"$f":"L13+F12","v":{"v":286,"d":"$286.00"}}]

{"sheet":"M43","index":44,"n_rows":12,"n_cols":13,"rows_kept":12,"merged":[[0,0,0,12],[2,0,2,12],[5,6,5,7],[7,0,8,0],[7,1,8,1],[7,2,8,2],[7,3,7,5],[7,6,7,8],[7,9,7,11],[7,12,8,12]]}
["RESTAURANTE CAMINOS DE HERRADURA"]
[]
["KARDEX"]
[]
["Artículo:",{"$f":"'MATERIA PRIMA Y MATERIALES'!E52","v":"PLATO ENTRADA"},null,null,"Unidad de medida:",null,"UNIDADES",null,"Codigo:",{"$f":"'MATERIA PRIMA Y MATERIALES'!D52","v":"1.1.04.43"}]
[{"$nulls":4},"Fecha de Corte:",null,{"$f":"NOW()","v":"2010-06-10T17:05:11.150"}]
[]
["FECHA","ORDEN DE \nPRODUCCIÓN","DETALLE",{"$nulls":6},"EXISTENCIAS",null,null,"RESPONSABLE"]
[{"$nulls":3},"CANT.","P.U.","P.T.","CANT.","P.U.","P.T.","CANT.","P.U.","P.T."]
[{"$nulls":9},230,{"v":0.7,"d":"$0.70"},{"v":161,"d":"$161.00"}]
[]
["2010-02-01",null,"SITUACIÓN INICIAL",230,{"v":0.7,"d":"$0.70"},{"$f":"$D$12*$E$12","v":{"v":161,"d":"$161.00"}},{"$nulls":3},{"$f":"J13+D12","v":230},{"$f":"$L$12/$J$12","v":{"v":0.7,"d":"$0.70"}},{"$f":"L13+F12","v":{"v":161,"d":"$161.00"}}]

{"sheet":"M44","index":45,"n_rows":12,"n_cols":13,"rows_kept":12,"merged":[[0,0,0,12],[2,0,2,12],[5,6,5,7],[7,0,8,0],[7,1,8,1],[7,2,8,2],[7,3,7,5],[7,6,7,8],[7,9,7,11],[7,12,8,12]]}
["RESTAURANTE CAMINOS DE HERRADURA"]
[]
["KARDEX"]
[]
["Artículo:",{"$f":"'MATERIA PRIMA Y MATERIALES'!E53","v":"PLATO POSTRE"},null,null,"Unidad de medida:",null,"UNIDADES",null,"Codigo:",{"$f":"'MATERIA PRIMA Y MATERIALES'!D53","v":"1.1.04.44"}]
[{"$nulls":4},"Fecha de Corte:",null,{"$f":"NOW()","v":"2010-06-10T17:05:11.150"}]
[]
["FECHA","ORDEN DE \nPRODUCCIÓN","DETALLE",{"$nulls":6},"EXISTENCIAS",null,null,"RESPONSABLE"]
[{"$nulls":3},"CANT.","P.U.","P.T.","CANT.","P.U.","P.T.","CANT.","P.U.","P.T."]
[{"$nulls":9},50,{"v":0.5,"d":"$0.50"},{"v":25,"d":"$25.00"}]
[]
["2010-02-01",null,"SITUACIÓN INICIAL",50,{"v":0.5,"d":"$0.50"},{"$f":"$D$12*$E$12","v":{"v":25,"d":"$25.00"}},{"$nulls":3},{"$f":"J13+D12","v":50},{"$f":"$L$12/$J$12","v":{"v":0.5,"d":"$0.50"}},{"$f":"L13+F12","v":{"v":25,"d":"$25.00"}}]

{"sheet":"M45","index":46,"n_rows":12,"n_cols":13,"rows_kept":12,"merged":[[0,0,0,12],[2,0,2,12],[5,6,5,7],[7,0,8,0],[7,1,8,1],[7,2,8,2],[7,3,7,5],[7,6,7,8],[7,9,7,11],[7,12,8,12]]}
["RESTAURANTE CAMINOS DE HERRADURA"]
[]
["KARDEX"]
[]
["Artículo:",{"$f":"'MATERIA PRIMA Y MATERIALES'!E54","v":"VASO"},null,null,"Unidad de medida:",null,"UNIDADES",null,"Codigo:",{"$f":"'MATERIA PRIMA Y MATERIALES'!D54","v":"1.1.04.45"}]
[{"$nulls":4},"Fecha de Corte:",null,{"$f":"NOW()","v":"2010-06-10T17:05:11.150"}]
[]
["FECHA","ORDEN DE \nPRODUCCIÓN","DETALLE",{"$nulls":6},"EXISTENCIAS",null,null,"RESPONSABLE"]
[{"$nulls":3},"CANT.","P.U.","P.T.","CANT.","P.U.","P.T.","CANT.","P.U.","P.T."]
[{"$nulls":9},120,{"v":0.8,"d":"$0.80"},{"v":96,"d":"$96.00"}]
[]
["2010-02-01",null,"SITUACIÓN INICIAL",120,{"v":0.8,"d":"$0.80"},{"$f":"$D$12*$E$12","v":{"v":96,"d":"$96.00"}},{"$nulls":3},{"$f":"J13+D12","v":120},{"$f":"$L$12/$J$12","v":{"v":0.8,"d":"$0.80"}},{"$f":"L13+F12","v":{"v":96,"d":"$96.00"}}]

{"sheet":"M46","index":47,"n_rows":12,"n_cols":13,"rows_kept":12,"merged":[[0,0,0,12],[2,0,2,12],[5,6,5,7],[7,0,8,0],[7,1,8,1],[7,2,8,2],[7,3,7,5],[7,6,7,8],[7,9,7,11],[7,12,8,12]]}
["RESTAURANTE CAMINOS DE HERRADURA"]
[]
["KARDEX"]
[]
["Artículo:",{"$f":"'MATERIA PRIMA Y MATERIALES'!E55","v":"COPA DE AGUA"},null,null,"Unidad de medida:",null,"UNIDADES",null,"Codigo:",{"$f":"'MATERIA PRIMA Y MATERIALES'!D55","v":"1.1.04.46"}]
[{"$nulls":4},"Fecha de Corte:",null,{"$f":"NOW()","v":"2010-06-10T17:05:11.150"}]
[]
["FECHA","ORDEN DE \nPRODUCCIÓN","DETALLE",{"$nulls":6},"EXISTENCIAS",null,null,"RESPONSABLE"]
[{"$nulls":3},"CANT.","P.U.","P.T.","CANT.","P.U.","P.T.","CANT.","P.U.","P.T."]
[{"$nulls":9},50,{"v":1.2,"d":"$1.20"},{"v":60,"d":"$60.00"}]
[]
["2010-02-01",null,"SITUACIÓN INICIAL",50,{"v":1.2,"d":"$1.20"},{"$f":"$D$12*$E$12","v":{"v":60,"d":"$60.00"}},{"$nulls":3},{"$f":"J13+D12","v":50},{"$f":"$L$12/$J$12","v":{"v":1.2,"d":"$1.20"}},{"$f":"L13+F12","v":{"v":60,"d":"$60.00"}}]

{"sheet":"M47","index":48,"n_rows":12,"n_cols":13,"rows_kept":12,"merged":[[0,0,0,12],[2,0,2,12],[5,6,5,7],[7,0,8,0],[7,1,8,1],[7,2,8,2],[7,3,7,5],[7,6,7,8],[7,9,7,11],[7,12,8,12]]}
["RESTAURANTE CAMINOS DE HERRADURA"]
[]
["KARDEX"]
[]
["Artículo:",{"$f":"'MATERIA PRIMA Y MATERIALES'!E56","v":"COPA DE VINO"},null,null,"Unidad de medida:",null,"UNIDADES",null,"Codigo:",{"$f":"'MATERIA PRIMA Y MATERIALES'!D56","v":"1.1.04.47"}]
[{"$nulls":4},"Fecha de Corte:",null,{"$f":"NOW()","v":"2010-06-10T17:05:11.150"}]
[]
["FECHA","ORDEN DE \nPRODUCCIÓN","DETALLE",{"$nulls":6},"EXISTENCIAS",null,null,"RESPONSABLE"]
[{"$nulls":3},"CANT.","P.U.","P.T.","CANT.","P.U.","P.T.","CANT.","P.U.","P.T."]
[{"$nulls":9},95,{"v":0.3,"d":"$0.30"},{"v":28.5,"d":"$28.50"}]
[]
["2010-02-01",null,"SITUACIÓN INICIAL",95,{"v":0.3,"d":"$0.30"},{"$f":"$D$12*$E$12","v":{"v":28.5,"d":"$28.50"}},{"$nulls":3},{"$f":"J13+D12","v":95},{"$f":"$L$12/$J$12","v":{"v":0.3,"d":"$0.30"}},{"$f":"L13+F12","v":{"v":28.5,"d":"$28.50"}}]

{"sheet":"M48","index":49,"n_rows":12,"n_cols":13,"rows_kept":12,"merged":[[0,0,0,12],[2,0,2,12],[5,6,5,7],[7,0,8,0],[7,1,8,1],[7,2,8,2],[7,3,7,5],[7,6,7,8],[7,9,7,11],[7,12,8,12]]}
["RESTAURANTE CAMINOS DE HERRADURA"]
[]
["KARDEX"]
[]
["Artículo:",{"$f":"'MATERIA PRIMA Y MATERIALES'!E57","v":"CENICEROS"},null,null,"Unidad de medida:",null,"UNIDADES",null,"Codigo:",{"$f":"'MATERIA PRIMA Y MATERIALES'!D57","v":"1.1.04.48"}]
[{"$nulls":4},"Fecha de Corte:",null,{"$f":"NOW()","v":"2010-06-10T17:05:11.150"}]
[]
["FECHA","ORDEN DE \nPRODUCCIÓN","DETALLE",{"$nulls":6},"EXISTENCIAS",null,null,"RESPONSABLE"]
[{"$nulls":3},"CANT.","P.U.","P.T.","CANT.","P.U.","P.T.","CANT.","P.U.","P.T."]
[{"$nulls":9},25,{"v":0.8,"d":"$0.80"},{"v":20,"d":"$20.00"}]
[]
["2010-02-01",null,"SITUACIÓN INICIAL",25,{"v":0.8,"d":"$0.80"},{"$f":"$D$12*$E$12","v":{"v":20,"d":"$20.00"}},{"$nulls":3},{"$f":"J13+D12","v":25},{"$f":"$L$12/$J$12","v":{"v":0.8,"d":"$0.80"}},{"$f":"L13+F12","v":{"v":20,"d":"$20.00"}}]

{"sheet":"M49","index":50,"n_rows":12,"n_cols":13,"rows_kept":12,"merged":[[0,0,0,12],[2,0,2,12],[5,6,5,7],[7,0,8,0],[7,1,8,1],[7,2,8,2],[7,3,7,5],[7,6,7,8],[7,9,7,11],[7,12,8,12]]}
["RESTAURANTE CAMINOS DE HERRADURA"]
[]
["KARDEX"]
[]
["Artículo:",{"$f":"'MATERIA PRIMA Y MATERIALES'!E58","v":"TENEDORES"},null,null,"Unidad de medida:",null,"UNIDADES",null,"Codigo:",{"$f":"'MATERIA PRIMA Y MATERIALES'!D58","v":"1.1.04.49"}]
[{"$nulls":4},"Fecha de Corte:",null,{"$f":"NOW()","v":"2010-06-10T17:05:11.150"}]
[]
["FECHA","ORDEN DE \nPRODUCCIÓN","DETALLE",{"$nulls":6},"EXISTENCIAS",null,null,"RESPONSABLE"]
[{"$nulls":3},"CANT.","P.U.","P.T.","CANT.","P.U.","P.T.","CANT.","P.U.","P.T."]
[{"$nulls":9},250,{"v":0.4,"d":"$0.40"},{"v":100,"d":"$100.00"}]
[]
["2010-02-01",null,"SITUACIÓN INICIAL",250,{"v":0.4,"d":"$0.40"},{"$f":"$D$12*$E$12","v":{"v":100,"d":"$100.00"}},{"$nulls":3},{"$f":"J13+D12","v":250},{"$f":"$L$12/$J$12","v":{"v":0.4,"d":"$0.40"}},{"$f":"L13+F12","v":{"v":100,"d":"$100.00"}}]

{"sheet":"M50","index":51,"n_rows":13,"n_cols":13,"rows_kept":13,"merged":[[0,0,0,12],[2,0,2,12],[5,6,5,7],[7,0,8,0],[7,1,8,1],[7,2,8,2],[7,3,7,5],[7,6,7,8],[7,9,7,11],[7,12,8,12]]}
["RESTAURANTE CAMINOS DE HERRADURA"]
[]
["KARDEX"]
[]
["Artículo:",{"$f":"'MATERIA PRIMA Y MATERIALES'!E59","v":"SERVILLETAS"},null,null,"Unidad de medida:",null,"PAQUETES",null,"Codigo:",{"$f":"'MATERIA PRIMA Y MATERIALES'!D59","v":"1.1.04.50"}]
[{"$nulls":4},"Fecha de Corte:",null,{"$f":"NOW()","v":"2010-06-10T17:05:11.150"}]
[]
["FECHA","ORDEN DE \nPRODUCCIÓN","DETALLE",{"$nulls":6},"EXISTENCIAS",null,null,"RESPONSABLE"]
[{"$nulls":3},"CANT.","P.U.","P.T.","CANT.","P.U.","P.T.","CANT.","P.U.","P.T."]
[{"$nulls":9},391,{"v":0.3,"d":"$0.30"},{"v":117.3,"d":"$117.30"}]
[]
["2010-03-01","500, 501,503,","TRASPASO A LAS LAS O.P.",{"$nulls":3},9,{"$f":"K13","v":{"v":0.3,"d":"$0.30"}},{"$f":"H12*G12","v":{"v":2.6999999999999997,"d":"$2.70"}},{"$f":"J13-G12","v":391},{"$f":"L12/J12","v":{"v":0.3,"d":"$0.30"}},{"$f":"L13-I12","v":{"v":117.3,"d":"$117.30"}}]
["2010-02-01",null,"SITUACIÓN INICIAL",400,{"v":0.3,"d":"$0.30"},{"$f":"$D$13*$E$13","v":{"v":120,"d":"$120.00"}},{"$nulls":3},{"$f":"J14+D13","v":400},{"$f":"$L$13/$J$13","v":{"v":0.3,"d":"$0.30"}},{"$f":"L14+F13","v":{"v":120,"d":"$120.00"}}]

{"sheet":"M51","index":52,"n_rows":9,"n_cols":13,"rows_kept":9,"hidden":true,"merged":[[0,0,0,12],[2,0,2,12],[5,6,5,7],[7,0,8,0],[7,1,8,1],[7,2,8,2],[7,3,7,5],[7,6,7,8],[7,9,7,11],[7,12,8,12]]}
["RESTAURANTE CAMINOS DE HERRADURA"]
[]
["KARDEX"]
[]
["Artículo:",{"$f":"'MATERIA PRIMA Y MATERIALES'!E60","v":"CONTRATOS"},"CODIGO ",null,"Unidad de medida:",null,"LIBRAS",null,"Codigo:"]
["Método:","PROMEDIO PONDERADO",null,null,"Fecha de Corte:",null,{"$f":"NOW()","v":"2010-06-10T17:05:11.150"}]
[]
["FECHA","ORDEN DE \nPRODUCCIÓN","DETALLE",{"$nulls":6},"EXISTENCIAS",null,null,"RESPONSABLE"]
[{"$nulls":3},"CANT.","P.U.","P.T.","CANT.","P.U.","P.T.","CANT.","P.U.","P.T."]

{"sheet":"M52","index":53,"n_rows":13,"n_cols":13,"rows_kept":13,"merged":[[0,0,0,12],[2,0,2,12],[5,6,5,7],[7,0,8,0],[7,1,8,1],[7,2,8,2],[7,3,7,5],[7,6,7,8],[7,9,7,11],[7,12,8,12]]}
["RESTAURANTE CAMINOS DE HERRADURA"]
[]
["KARDEX"]
[]
["Artículo:",{"$f":"'MATERIA PRIMA Y MATERIALES'!E60","v":"CONTRATOS"},null,null,"Unidad de medida:",null,"CONTRATOS",null,"Codigo:",{"$f":"'MATERIA PRIMA Y MATERIALES'!D60","v":"1.1.04.51"}]
[{"$nulls":4},"Fecha de Corte:",null,{"$f":"NOW()","v":"2010-06-10T17:05:11.150"}]
[]
["FECHA","ORDEN DE \nPRODUCCIÓN","DETALLE",{"$nulls":6},"EXISTENCIAS",null,null,"RESPONSABLE"]
[{"$nulls":3},"CANT.","P.U.","P.T.","CANT.","P.U.","P.T.","CANT.","P.U.","P.T."]
[{"$nulls":9},396,{"v":0.25,"d":"$0.25"},{"v":99,"d":"$99.00"}]
[]
["2010-03-01","500,501,503","CONTRATOS",{"$nulls":3},4,{"$f":"K13","v":{"v":0.25,"d":"$0.25"}},{"$f":"H12*G12","v":{"v":1,"d":"$1.00"}},{"$f":"J13-G12","v":396},{"$f":"L12/J12","v":{"v":0.25,"d":"$0.25"}},{"$f":"L13-I12","v":{"v":99,"d":"$99.00"}}]
["2010-02-01",null,"SITUACIÓN INICIAL",400,{"v":0.25,"d":"$0.25"},{"$f":"$D$13*$E$13","v":{"v":100,"d":"$100.00"}},{"$nulls":3},{"$f":"J14+D13","v":400},{"$f":"$L$13/$J$13","v":{"v":0.25,"d":"$0.25"}},{"$f":"L14+F13","v":{"v":100,"d":"$100.00"}}]

{"sheet":"M53","index":54,"n_rows":9,"n_cols":13,"rows_kept":9,"merged":[[0,0,0,12],[2,0,2,12],[5,6,5,7],[7,0,8,0],[7,1,8,1],[7,2,8,2],[7,3,7,5],[7,6,7,8],[7,9,7,11],[7,12,8,12]]}
["RESTAURANTE CAMINOS DE HERRADURA"]
[]
["KARDEX"]
[]
["Artículo:",{"$f":"'MATERIA PRIMA Y MATERIALES'!E61","v":"#'M53'!A1"},null,null,"Unidad de medida:",null,"LIBRAS",null,null,{"$f":"'MATERIA PRIMA Y MATERIALES'!D61","v":"1.1.04.52"}]
[{"$nulls":4},"Fecha de Corte:",null,{"$f":"NOW()","v":"2010-06-10T17:05:11.150"}]
[]
["FECHA","ORDEN DE \nPRODUCCIÓN","DETALLE",{"$nulls":6},"EXISTENCIAS",null,null,"RESPONSABLE"]
[{"$nulls":3},"CANT.","P.U.","P.T.","CANT.","P.U.","P.T.","CANT.","P.U.","P.T."]

{"sheet":"S1","index":55,"n_rows":9,"n_cols":13,"rows_kept":9,"merged":[[0,0,0,12],[2,0,2,12],[5,6,5,7],[7,0,8,0],[7,1,8,1],[7,2,8,2],[7,3,7,5],[7,6,7,8],[7,9,7,11],[7,12,8,12]]}
["RESTAURANTE CAMINOS DE HERRADURA"]
[]
["KARDEX"]
[]
["Artículo:","ACEITE","CODIGO ",null,"Unidad de medida:",null,"LIBRAS"]
["Método:","PROMEDIO PONDERADO",null,null,"Fecha de Corte:",null,{"$f":"NOW()","v":"2010-06-10T17:05:11.150"}]
[]
["FECHA","ORDEN DE \nPRODUCCIÓN","DETALLE",{"$nulls":6},"EXISTENCIAS",null,null,"RESPONSABLE"]
[{"$nulls":3},"CANT.","P.U.","P.T.","CANT.","P.U.","P.T.","CANT.","P.U.","P.T."]

{"sheet":"S2","index":56,"n_rows":9,"n_cols":13,"rows_kept":9,"merged":[[0,0,0,12],[2,0,2,12],[5,6,5,7],[7,0,8,0],[7,1,8,1],[7,2,8,2],[7,3,7,5],[7,6,7,8],[7,9,7,11],[7,12,8,12]]}
["RESTAURANTE CAMINOS DE HERRADURA"]
[]
["KARDEX"]
[]
["Artículo:","ACEITE","CODIGO ",null,"Unidad de medida:",null,"LIBRAS"]
["Método:","PROMEDIO PONDERADO",null,null,"Fecha de Corte:",null,{"$f":"NOW()","v":"2010-06-10T17:05:11.150"}]
[]
["FECHA","ORDEN DE \nPRODUCCIÓN","DETALLE",{"$nulls":6},"EXISTENCIAS",null,null,"RESPONSABLE"]
[{"$nulls":3},"CANT.","P.U.","P.T.","CANT.","P.U.","P.T.","CANT.","P.U.","P.T."]

{"sheet":"S3","index":57,"n_rows":9,"n_cols":13,"rows_kept":9,"merged":[[0,0,0,12],[2,0,2,12],[5,6,5,7],[7,0,8,0],[7,1,8,1],[7,2,8,2],[7,3,7,5],[7,6,7,8],[7,9,7,11],[7,12,8,12]]}
["RESTAURANTE CAMINOS DE HERRADURA"]
[]
["KARDEX"]
[]
["Artículo:","ACEITE","CODIGO ",null,"Unidad de medida:",null,"LIBRAS"]
["Método:","PROMEDIO PONDERADO",null,null,"Fecha de Corte:",null,{"$f":"NOW()","v":"2010-06-10T17:05:11.150"}]
[]
["FECHA","ORDEN DE \nPRODUCCIÓN","DETALLE",{"$nulls":6},"EXISTENCIAS",null,null,"RESPONSABLE"]
[{"$nulls":3},"CANT.","P.U.","P.T.","CANT.","P.U.","P.T.","CANT.","P.U.","P.T."]

{"sheet":"S4","index":58,"n_rows":9,"n_cols":13,"rows_kept":9,"merged":[[0,0,0,12],[2,0,2,12],[5,6,5,7],[7,0,8,0],[7,1,8,1],[7,2,8,2],[7,3,7,5],[7,6,7,8],[7,9,7,11],[7,12,8,12]]}
["RESTAURANTE CAMINOS DE HERRADURA"]
[]
["KARDEX"]
[]
["Artículo:","ACEITE","CODIGO ",null,"Unidad de medida:",null,"LIBRAS"]
["Método:","PROMEDIO PONDERADO",null,null,"Fecha de Corte:",null,{"$f":"NOW()","v":"2010-06-10T17:05:11.150"}]
[]
["FECHA","ORDEN DE \nPRODUCCIÓN","DETALLE",{"$nulls":6},"EXISTENCIAS",null,null,"RESPONSABLE"]
[{"$nulls":3},"CANT.","P.U.","P.T.","CANT.","P.U.","P.T.","CANT.","P.U.","P.T."]

{"sheet":"S5","index":59,"n_rows":9,"n_cols":13,"rows_kept":9,"merged":[[0,0,0,12],[2,0,2,12],[5,6,5,7],[7,0,8,0],[7,1,8,1],[7,2,8,2],[7,3,7,5],[7,6,7,8],[7,9,7,11],[7,12,8,12]]}
["RESTAURANTE CAMINOS DE HERRADURA"]
[]
["KARDEX"]
[]
["Artículo:","ACEITE","CODIGO ",null,"Unidad de medida:",null,"LIBRAS"]
["Método:","PROMEDIO PONDERADO",null,null,"Fecha de Corte:",null,{"$f":"NOW()","v":"2010-06-10T17:05:11.150"}]
[]
["FECHA","ORDEN DE \nPRODUCCIÓN","DETALLE",{"$nulls":6},"EXISTENCIAS",null,null,"RESPONSABLE"]
[{"$nulls":3},"CANT.","P.U.","P.T.","CANT.","P.U.","P.T.","CANT.","P.U.","P.T."]

{"sheet":"S6","index":60,"n_rows":9,"n_cols":13,"rows_kept":9,"merged":[[0,0,0,12],[2,0,2,12],[5,6,5,7],[7,0,8,0],[7,1,8,1],[7,2,8,2],[7,3,7,5],[7,6,7,8],[7,9,7,11],[7,12,8,12]]}
["RESTAURANTE CAMINOS DE HERRADURA"]
[]
["KARDEX"]
[]
["Artículo:","ACEITE","CODIGO ",null,"Unidad de medida:",null,"LIBRAS"]
["Método:","PROMEDIO PONDERADO",null,null,"Fecha de Corte:",null,{"$f":"NOW()","v":"2010-06-10T17:05:11.150"}]
[]
["FECHA","ORDEN DE \nPRODUCCIÓN","DETALLE",{"$nulls":6},"EXISTENCIAS",null,null,"RESPONSABLE"]
[{"$nulls":3},"CANT.","P.U.","P.T.","CANT.","P.U.","P.T.","CANT.","P.U.","P.T."]

{"sheet":"S7","index":61,"n_rows":9,"n_cols":13,"rows_kept":9,"merged":[[0,0,0,12],[2,0,2,12],[5,6,5,7],[7,0,8,0],[7,1,8,1],[7,2,8,2],[7,3,7,5],[7,6,7,8],[7,9,7,11],[7,12,8,12]]}
["RESTAURANTE CAMINOS DE HERRADURA"]
[]
["KARDEX"]
[]
["Artículo:","ACEITE","CODIGO ",null,"Unidad de medida:",null,"LIBRAS"]
["Método:","PROMEDIO PONDERADO",null,null,"Fecha de Corte:",null,{"$f":"NOW()","v":"2010-06-10T17:05:11.150"}]
[]
["FECHA","ORDEN DE \nPRODUCCIÓN","DETALLE",{"$nulls":6},"EXISTENCIAS",null,null,"RESPONSABLE"]
[{"$nulls":3},"CANT.","P.U.","P.T.","CANT.","P.U.","P.T.","CANT.","P.U.","P.T."]

{"sheet":"S8","index":62,"n_rows":9,"n_cols":13,"rows_kept":9,"merged":[[0,0,0,12],[2,0,2,12],[5,6,5,7],[7,0,8,0],[7,1,8,1],[7,2,8,2],[7,3,7,5],[7,6,7,8],[7,9,7,11],[7,12,8,12]]}
["RESTAURANTE CAMINOS DE HERRADURA"]
[]
["KARDEX"]
[]
["Artículo:","ACEITE","CODIGO ",null,"Unidad de medida:",null,"LIBRAS"]
["Método:","PROMEDIO PONDERADO",null,null,"Fecha de Corte:",null,{"$f":"NOW()","v":"2010-06-10T17:05:11.150"}]
[]
["FECHA","ORDEN DE \nPRODUCCIÓN","DETALLE",{"$nulls":6},"EXISTENCIAS",null,null,"RESPONSABLE"]
[{"$nulls":3},"CANT.","P.U.","P.T.","CANT.","P.U.","P.T.","CANT.","P.U.","P.T."]

{"sheet":"S9","index":63,"n_rows":9,"n_cols":13,"rows_kept":9,"merged":[[0,0,0,12],[2,0,2,12],[5,6,5,7],[7,0,8,0],[7,1,8,1],[7,2,8,2],[7,3,7,5],[7,6,7,8],[7,9,7,11],[7,12,8,12]]}
["RESTAURANTE CAMINOS DE HERRADURA"]
[]
["KARDEX"]
[]
["Artículo:","ACEITE","CODIGO ",null,"Unidad de medida:",null,"LIBRAS"]
["Método:","PROMEDIO PONDERADO",null,null,"Fecha de Corte:",null,{"$f":"NOW()","v":"2010-06-10T17:05:11.150"}]
[]
["FECHA","ORDEN DE \nPRODUCCIÓN","DETALLE",{"$nulls":6},"EXISTENCIAS",null,null,"RESPONSABLE"]
[{"$nulls":3},"CANT.","P.U.","P.T.","CANT.","P.U.","P.T.","CANT.","P.U.","P.T."]

{"sheet":"S10","index":64,"n_rows":9,"n_cols":13,"rows_kept":9,"merged":[[0,0,0,12],[2,0,2,12],[5,6,5,7],[7,0,8,0],[7,1,8,1],[7,2,8,2],[7,3,7,5],[7,6,7,8],[7,9,7,11],[7,12,8,12]]}
["RESTAURANTE CAMINOS DE HERRADURA"]
[]
["KARDEX"]
[]
["Artículo:","ACEITE","CODIGO ",null,"Unidad de medida:",null,"LIBRAS"]
["Método:","PROMEDIO PONDERADO",null,null,"Fecha de Corte:",null,{"$f":"NOW()","v":"2010-06-10T17:05:11.150"}]
[]
["FECHA","ORDEN DE \nPRODUCCIÓN","DETALLE",{"$nulls":6},"EXISTENCIAS",null,null,"RESPONSABLE"]
[{"$nulls":3},"CANT.","P.U.","P.T.","CANT.","P.U.","P.T.","CANT.","P.U.","P.T."]

{"sheet":"S11","index":65,"n_rows":9,"n_cols":13,"rows_kept":9,"merged":[[0,0,0,12],[2,0,2,12],[5,6,5,7],[7,0,8,0],[7,1,8,1],[7,2,8,2],[7,3,7,5],[7,6,7,8],[7,9,7,11],[7,12,8,12]]}
["RESTAURANTE CAMINOS DE HERRADURA"]
[]
["KARDEX"]
[]
["Artículo:","ACEITE","CODIGO ",null,"Unidad de medida:",null,"LIBRAS"]
["Método:","PROMEDIO PONDERADO",null,null,"Fecha de Corte:",null,{"$f":"NOW()","v":"2010-06-10T17:05:11.150"}]
[]
["FECHA","ORDEN DE \nPRODUCCIÓN","DETALLE",{"$nulls":6},"EXISTENCIAS",null,null,"RESPONSABLE"]
[{"$nulls":3},"CANT.","P.U.","P.T.","CANT.","P.U.","P.T.","CANT.","P.U.","P.T."]

{"sheet":"S12","index":66,"n_rows":9,"n_cols":13,"rows_kept":9,"merged":[[0,0,0,12],[2,0,2,12],[5,6,5,7],[7,0,8,0],[7,1,8,1],[7,2,8,2],[7,3,7,5],[7,6,7,8],[7,9,7,11],[7,12,8,12]]}
["RESTAURANTE CAMINOS DE HERRADURA"]
[]
["KARDEX"]
[]
["Artículo:","ACEITE","CODIGO ",null,"Unidad de medida:",null,"LIBRAS"]
["Método:","PROMEDIO PONDERADO",null,null,"Fecha de Corte:",null,{"$f":"NOW()","v":"2010-06-10T17:05:11.150"}]
[]
["FECHA","ORDEN DE \nPRODUCCIÓN","DETALLE",{"$nulls":6},"EXISTENCIAS",null,null,"RESPONSABLE"]
[{"$nulls":3},"CANT.","P.U.","P.T.","CANT.","P.U.","P.T.","CANT.","P.U.","P.T."]

{"sheet":"S13","index":67,"n_rows":9,"n_cols":13,"rows_kept":9,"merged":[[0,0,0,12],[2,0,2,12],[5,6,5,7],[7,0,8,0],[7,1,8,1],[7,2,8,2],[7,3,7,5],[7,6,7,8],[7,9,7,11],[7,12,8,12]]}
["RESTAURANTE CAMINOS DE HERRADURA"]
[]
["KARDEX"]
[]
["Artículo:","ACEITE","CODIGO ",null,"Unidad de medida:",null,"LIBRAS"]
["Método:","PROMEDIO PONDERADO",null,null,"Fecha de Corte:",null,{"$f":"NOW()","v":"2010-06-10T17:05:11.150"}]
[]
["FECHA","ORDEN DE \nPRODUCCIÓN","DETALLE",{"$nulls":6},"EXISTENCIAS",null,null,"RESPONSABLE"]
[{"$nulls":3},"CANT.","P.U.","P.T.","CANT.","P.U.","P.T.","CANT.","P.U.","P.T."]

{"sheet":"S14","index":68,"n_rows":9,"n_cols":13,"rows_kept":9,"merged":[[0,0,0,12],[2,0,2,12],[5,6,5,7],[7,0,8,0],[7,1,8,1],[7,2,8,2],[7,3,7,5],[7,6,7,8],[7,9,7,11],[7,12,8,12]]}
["RESTAURANTE CAMINOS DE HERRADURA"]
[]
["KARDEX"]
[]
["Artículo:","ACEITE","CODIGO ",null,"Unidad de medida:",null,"LIBRAS"]
["Método:","PROMEDIO PONDERADO",null,null,"Fecha de Corte:",null,{"$f":"NOW()","v":"2010-06-10T17:05:11.150"}]
[]
["FECHA","ORDEN DE \nPRODUCCIÓN","DETALLE",{"$nulls":6},"EXISTENCIAS",null,null,"RESPONSABLE"]
[{"$nulls":3},"CANT.","P.U.","P.T.","CANT.","P.U.","P.T.","CANT.","P.U.","P.T."]

{"sheet":"S15","index":69,"n_rows":9,"n_cols":13,"rows_kept":9,"merged":[[0,0,0,12],[2,0,2,12],[5,6,5,7],[7,0,8,0],[7,1,8,1],[7,2,8,2],[7,3,7,5],[7,6,7,8],[7,9,7,11],[7,12,8,12]]}
["RESTAURANTE CAMINOS DE HERRADURA"]
[]
["KARDEX"]
[]
["Artículo:","ACEITE","CODIGO ",null,"Unidad de medida:",null,"LIBRAS"]
["Método:","PROMEDIO PONDERADO",null,null,"Fecha de Corte:",null,{"$f":"NOW()","v":"2010-06-10T17:05:11.150"}]
[]
["FECHA","ORDEN DE \nPRODUCCIÓN","DETALLE",{"$nulls":6},"EXISTENCIAS",null,null,"RESPONSABLE"]
[{"$nulls":3},"CANT.","P.U.","P.T.","CANT.","P.U.","P.T.","CANT.","P.U.","P.T."]

{"sheet":"S16","index":70,"n_rows":9,"n_cols":13,"rows_kept":9,"merged":[[0,0,0,12],[2,0,2,12],[5,6,5,7],[7,0,8,0],[7,1,8,1],[7,2,8,2],[7,3,7,5],[7,6,7,8],[7,9,7,11],[7,12,8,12]]}
["RESTAURANTE CAMINOS DE HERRADURA"]
[]
["KARDEX"]
[]
["Artículo:","ACEITE","CODIGO ",null,"Unidad de medida:",null,"LIBRAS"]
["Método:","PROMEDIO PONDERADO",null,null,"Fecha de Corte:",null,{"$f":"NOW()","v":"2010-06-10T17:05:11.150"}]
[]
["FECHA","ORDEN DE \nPRODUCCIÓN","DETALLE",{"$nulls":6},"EXISTENCIAS",null,null,"RESPONSABLE"]
[{"$nulls":3},"CANT.","P.U.","P.T.","CANT.","P.U.","P.T.","CANT.","P.U.","P.T."]

{"sheet":"S17","index":71,"n_rows":9,"n_cols":13,"rows_kept":9,"merged":[[0,0,0,12],[2,0,2,12],[5,6,5,7],[7,0,8,0],[7,1,8,1],[7,2,8,2],[7,3,7,5],[7,6,7,8],[7,9,7,11],[7,12,8,12]]}
["RESTAURANTE CAMINOS DE HERRADURA"]
[]
["KARDEX"]
[]
["Artículo:","ACEITE","CODIGO ",null,"Unidad de medida:",null,"LIBRAS"]
["Método:","PROMEDIO PONDERADO",null,null,"Fecha de Corte:",null,{"$f":"NOW()","v":"2010-06-10T17:05:11.150"}]
[]
["FECHA","ORDEN DE \nPRODUCCIÓN","DETALLE",{"$nulls":6},"EXISTENCIAS",null,null,"RESPONSABLE"]
[{"$nulls":3},"CANT.","P.U.","P.T.","CANT.","P.U.","P.T.","CANT.","P.U.","P.T."]

{"sheet":"S18","index":72,"n_rows":9,"n_cols":13,"rows_kept":9,"merged":[[0,0,0,12],[2,0,2,12],[5,6,5,7],[7,0,8,0],[7,1,8,1],[7,2,8,2],[7,3,7,5],[7,6,7,8],[7,9,7,11],[7,12,8,12]]}
["RESTAURANTE CAMINOS DE HERRADURA"]
[]
["KARDEX"]
[]
["Artículo:","ACEITE","CODIGO ",null,"Unidad de medida:",null,"LIBRAS"]
["Método:","PROMEDIO PONDERADO",null,null,"Fecha de Corte:",null,{"$f":"NOW()","v":"2010-06-10T17:05:11.150"}]
[]
["FECHA","ORDEN DE \nPRODUCCIÓN","DETALLE",{"$nulls":6},"EXISTENCIAS",null,null,"RESPONSABLE"]
[{"$nulls":3},"CANT.","P.U.","P.T.","CANT.","P.U.","P.T.","CANT.","P.U.","P.T."]

{"sheet":"S19","index":73,"n_rows":9,"n_cols":13,"rows_kept":9,"merged":[[0,0,0,12],[2,0,2,12],[5,6,5,7],[7,0,8,0],[7,1,8,1],[7,2,8,2],[7,3,7,5],[7,6,7,8],[7,9,7,11],[7,12,8,12]]}
["RESTAURANTE CAMINOS DE HERRADURA"]
[]
["KARDEX"]
[]
["Artículo:","ACEITE","CODIGO ",null,"Unidad de medida:",null,"LIBRAS"]
["Método:","PROMEDIO PONDERADO",null,null,"Fecha de Corte:",null,{"$f":"NOW()","v":"2010-06-10T17:05:11.150"}]
[]
["FECHA","ORDEN DE \nPRODUCCIÓN","DETALLE",{"$nulls":6},"EXISTENCIAS",null,null,"RESPONSABLE"]
[{"$nulls":3},"CANT.","P.U.","P.T.","CANT.","P.U.","P.T.","CANT.","P.U.","P.T."]

{"sheet":"S20","index":74,"n_rows":9,"n_cols":13,"rows_kept":9,"merged":[[0,0,0,12],[2,0,2,12],[5,6,5,7],[7,0,8,0],[7,1,8,1],[7,2,8,2],[7,3,7,5],[7,6,7,8],[7,9,7,11],[7,12,8,12]]}
["RESTAURANTE CAMINOS DE HERRADURA"]
[]
["KARDEX"]
[]
["Artículo:","ACEITE","CODIGO ",null,"Unidad de medida:",null,"LIBRAS"]
["Método:","PROMEDIO PONDERADO",null,null,"Fecha de Corte:",null,{"$f":"NOW()","v":"2010-06-10T17:05:11.150"}]
[]
["FECHA","ORDEN DE \nPRODUCCIÓN","DETALLE",{"$nulls":6},"EXISTENCIAS",null,null,"RESPONSABLE"]
[{"$nulls":3},"CANT.","P.U.","P.T.","CANT.","P.U.","P.T.","CANT.","P.U.","P.T."]

{"sheet":"S21","index":75,"n_rows":9,"n_cols":13,"rows_kept":9,"merged":[[0,0,0,12],[2,0,2,12],[5,6,5,7],[7,0,8,0],[7,1,8,1],[7,2,8,2],[7,3,7,5],[7,6,7,8],[7,9,7,11],[7,12,8,12]]}
["RESTAURANTE CAMINOS DE HERRADURA"]
[]
["KARDEX"]
[]
["Artículo:","ACEITE","CODIGO ",null,"Unidad de medida:",null,"LIBRAS"]
["Método:","PROMEDIO PONDERADO",null,null,"Fecha de Corte:",null,{"$f":"NOW()","v":"2010-06-10T17:05:11.150"}]
[]
["FECHA","ORDEN DE \nPRODUCCIÓN","DETALLE",{"$nulls":6},"EXISTENCIAS",null,null,"RESPONSABLE"]
[{"$nulls":3},"CANT.","P.U.","P.T.","CANT.","P.U.","P.T.","CANT.","P.U.","P.T."]

{"sheet":"S22","index":76,"n_rows":9,"n_cols":13,"rows_kept":9,"merged":[[0,0,0,12],[2,0,2,12],[5,6,5,7],[7,0,8,0],[7,1,8,1],[7,2,8,2],[7,3,7,5],[7,6,7,8],[7,9,7,11],[7,12,8,12]]}
["RESTAURANTE CAMINOS DE HERRADURA"]
[]
["KARDEX"]
[]
["Artículo:","ACEITE","CODIGO ",null,"Unidad de medida:",null,"LIBRAS"]
["Método:","PROMEDIO PONDERADO",null,null,"Fecha de Corte:",null,{"$f":"NOW()","v":"2010-06-10T17:05:11.150"}]
[]
["FECHA","ORDEN DE \nPRODUCCIÓN","DETALLE",{"$nulls":6},"EXISTENCIAS",null,null,"RESPONSABLE"]
[{"$nulls":3},"CANT.","P.U.","P.T.","CANT.","P.U.","P.T.","CANT.","P.U.","P.T."]

{"sheet":"S23","index":77,"n_rows":9,"n_cols":13,"rows_kept":9,"merged":[[0,0,0,12],[2,0,2,12],[5,6,5,7],[7,0,8,0],[7,1,8,1],[7,2,8,2],[7,3,7,5],[7,6,7,8],[7,9,7,11],[7,12,8,12]]}
["RESTAURANTE CAMINOS DE HERRADURA"]
[]
["KARDEX"]
[]
["Artículo:","ACEITE","CODIGO ",null,"Unidad de medida:",null,"LIBRAS"]
["Método:","PROMEDIO PONDERADO",null,null,"Fecha de Corte:",null,{"$f":"NOW()","v":"2010-06-10T17:05:11.150"}]
[]
["FECHA","ORDEN DE \nPRODUCCIÓN","DETALLE",{"$nulls":6},"EXISTENCIAS",null,null,"RESPONSABLE"]
[{"$nulls":3},"CANT.","P.U.","P.T.","CANT.","P.U.","P.T.","CANT.","P.U.","P.T."]

{"sheet":"INFORME DE INVENTARIOS","index":78,"n_rows":76,"n_cols":12,"rows_kept":76,"merged":[[1,1,1,4],[3,1,3,4],[8,1,9,1],[8,2,9,2],[8,3,8,4],[44,3,44,4],[47,3,47,4],[67,3,67,4],[70,3,70,4]]}
[]
[null,"RESTAURANTE CAMINOS DE HERRADURA",{"$nulls":4},"ACEITE",null,"LENTEJAS"]
[{"$nulls":6},"ACELGA",null,"LIMON"]
[null,"INFORME DE INVENTARIOS - ACTIVOS",{"$nulls":4},"ACHOTE",null,"LOMO"]
[{"$nulls":6},"AGUACATE ",null,"MAGGI"]
[null,"Artículo:","TODOS","Unidad de medida:","Unidades",null,"AJO ",null,"MAIZ"]
[{"$nulls":3},"Fecha de corte:",{"$f":"NOW()","v":"2010-06-10T17:05:11.150"},null,"APANADURA",null,"MANTECA"]
[{"$nulls":6},"APIO",null,"MANTEQUILLA"]
[null,"CODIGO","PRODUCTO","EXISTENCIAS",null,null,"ARROZ",null,"MARACUYA"]
[{"$nulls":3},"CANT.","P.T.",null,"ARVEJA",null,"MELLOCOS"]
[null,{"$f":"'MATERIA PRIMA Y MATERIALES'!D10","v":"1.1.04.01"},{"$f":"IF(MID('M1'!B5,1,1)=\"#\",\"\",'M1'!B5)","v":"COCINAS INDUSTRIALES GRANDES"},{"$f":"'M1'!J10","v":3},{"$f":"'M1'!L10","v":{"v":540,"d":"$540.00"}},null,"AZUCAR",null,"MORA"]
[null,{"$f":"'MATERIA PRIMA Y MATERIALES'!D11","v":"1.1.04.02"},{"$f":"IF(MID('M2'!B5,1,1)=\"#\",\"\",'M2'!B5)","v":"COCINAS INDUSTRIALES  PEQUEÑAS"},{"$f":"'M2'!J10","v":2},{"$f":"'M2'!L10","v":{"v":180,"d":"$180.00"}},null,"BROCOLI",null,"MOROCHO","AVENA",null,"MELON"]
[null,{"$f":"'MATERIA PRIMA Y MATERIALES'!D12","v":"1.1.04.03"},{"$f":"IF(MID('M3'!B5,1,1)=\"#\",\"\",'M3'!B5)","v":"REFRIGERADORA 13 PIES"},{"$f":"'M3'!J10","v":1},{"$f":"'M3'!L10","v":{"v":180,"d":"$180.00"}},null,"CALABAZA",null,"MORTADELA"]
[null,{"$f":"'MATERIA PRIMA Y MATERIALES'!D13","v":"1.1.04.04"},{"$f":"IF(MID('M4'!B5,1,1)=\"#\",\"\",'M4'!B5)","v":"CONGELADOR"},{"$f":"'M4'!J10","v":1},{"$f":"'M4'!L10","v":{"v":700,"d":"$700.00"}},null,"CAMARONES",null,"MOSTAZA"]
[null,{"$f":"'MATERIA PRIMA Y MATERIALES'!D14","v":"1.1.04.05"},{"$f":"IF(MID('M5'!B5,1,1)=\"#\",\"\",'M5'!B5)","v":"HORNO INDUSTRIAL"},{"$f":"'M5'!J10","v":1},{"$f":"'M5'!L10","v":{"v":500,"d":"$500.00"}},null,"CANELA",null,"NARANJILLA"]
[null,{"$f":"'MATERIA PRIMA Y MATERIALES'!D15","v":"1.1.04.06"},{"$f":"IF(MID('M6'!B5,1,1)=\"#\",\"\",'M6'!B5)","v":"REPISA PARA VAJILLA"},{"$f":"'M6'!J10","v":1},{"$f":"'M6'!L10","v":{"v":150,"d":"$150.00"}},null,"CANGUIL ",null,"NUEZ MOSCADA"]
[null,{"$f":"'MATERIA PRIMA Y MATERIALES'!D16","v":"1.1.04.07"},{"$f":"IF(MID('M7'!B5,1,1)=\"#\",\"\",'M7'!B5)","v":"MESA"},{"$f":"'M7'!J10","v":1},{"$f":"'M7'!L10","v":{"v":90,"d":"$90.00"}},null,"CARNE MOLIDA",null,"OREGANO"]
[null,{"$f":"'MATERIA PRIMA Y MATERIALES'!D17","v":"1.1.04.08"},{"$f":"IF(MID('M8'!B5,1,1)=\"#\",\"\",'M8'!B5)","v":"TANQUES DE GAS"},{"$f":"'M8'!J10","v":6},{"$f":"'M8'!L10","v":{"v":180,"d":"$180.00"}},null,"CEBOLLA",null,"PAPAS"]
[null,{"$f":"'MATERIA PRIMA Y MATERIALES'!D18","v":"1.1.04.09"},{"$f":"IF(MID('M9'!B5,1,1)=\"#\",\"\",'M9'!B5)","v":"OLLAS DE PRESIÓN"},{"$f":"'M9'!J10","v":5},{"$f":"'M9'!L10","v":{"v":300,"d":"$300.00"}},null,"CEBOLLA LARGA",null,"PAPAYA"]
[null,{"$f":"'MATERIA PRIMA Y MATERIALES'!D19","v":"1.1.04.10"},{"$f":"IF(MID('M10'!B5,1,1)=\"#\",\"\",'M10'!B5)","v":"OLLAS CON TAPAS GRANDES"},{"$f":"'M10'!J10","v":4},{"$f":"'M10'!L10","v":{"v":520,"d":"$520.00"}},null,"CEDRON",null,"PEPINILLO"]
[null,{"$f":"'MATERIA PRIMA Y MATERIALES'!D20","v":"1.1.04.11"},{"$f":"IF(MID('M11'!B5,1,1)=\"#\",\"\",'M11'!B5)","v":"OLLAS CON TAPAS MEDIANAS"},{"$f":"'M11'!J10","v":8},{"$f":"'M11'!L10","v":{"v":480,"d":"$480.00"}},null,"CHAMPIÑONES",null,"PEREJIL"]
[null,{"$f":"'MATERIA PRIMA Y MATERIALES'!D21","v":"1.1.04.12"},{"$f":"IF(MID('M12'!B5,1,1)=\"#\",\"\",'M12'!B5)","v":"OLLAS CON TAPAS PEQUEÑAS"},{"$f":"'M12'!J10","v":10},{"$f":"'M12'!L10","v":{"v":300,"d":"$300.00"}},null,"CHANCHO",null,"PESCADO"]
[null,{"$f":"'MATERIA PRIMA Y MATERIALES'!D22","v":"1.1.04.13"},{"$f":"IF(MID('M13'!B5,1,1)=\"#\",\"\",'M13'!B5)","v":"VALDES"},{"$f":"'M13'!J10","v":4},{"$f":"'M13'!L10","v":{"v":16,"d":"$16.00"}},null,"CHOCHOS ",null,"PIMIENTA"]
[null,{"$f":"'MATERIA PRIMA Y MATERIALES'!D23","v":"1.1.04.14"},{"$f":"IF(MID('M14'!B5,1,1)=\"#\",\"\",'M14'!B5)","v":"PAILA"},{"$f":"'M14'!J10","v":5},{"$f":"'M14'!L10","v":{"v":400,"d":"$400.00"}},null,"CHUCHUCA ",null,"PIMIENTA"]
[null,{"$f":"'MATERIA PRIMA Y MATERIALES'!D24","v":"1.1.04.15"},{"$f":"IF(MID('M15'!B5,1,1)=\"#\",\"\",'M15'!B5)","v":"LICUADORA INDUSTRIAL"},{"$f":"'M15'!J10","v":1},{"$f":"'M15'!L10","v":{"v":500,"d":"$500.00"}},null,"CHULETA ",null,"PIMIENTOS "]
[null,{"$f":"'MATERIA PRIMA Y MATERIALES'!D25","v":"1.1.04.16"},{"$f":"IF(MID('M16'!B5,1,1)=\"#\",\"\",'M16'!B5)","v":"LICUADORA OSTER"},{"$f":"'M16'!J10","v":1},{"$f":"'M16'!L10","v":{"v":60,"d":"$60.00"}},null,"CLAVOS DE OLOR",null,"PIÑA"]
[null,{"$f":"'MATERIA PRIMA Y MATERIALES'!D26","v":"1.1.04.17"},{"$f":"IF(MID('M17'!B5,1,1)=\"#\",\"\",'M17'!B5)","v":"FREIDORES"},{"$f":"'M17'!J10","v":6},{"$f":"'M17'!L10","v":{"v":27,"d":"$27.00"}},null,"COL",null,"PLATANO MADURO"]
[null,{"$f":"'MATERIA PRIMA Y MATERIALES'!D27","v":"1.1.04.18"},{"$f":"IF(MID('M18'!B5,1,1)=\"#\",\"\",'M18'!B5)","v":"REFRIGERADORA MABE"},{"$f":"'M18'!J10","v":1},{"$f":"'M18'!L10","v":{"v":600,"d":"$600.00"}},null,"COL MORADA",null,"POLLOS "]
[null,{"$f":"'MATERIA PRIMA Y MATERIALES'!D28","v":"1.1.04.19"},{"$f":"IF(MID('M19'!B5,1,1)=\"#\",\"\",'M19'!B5)","v":"DAEWOO"},{"$f":"'M19'!J10","v":2},{"$f":"'M19'!L10","v":{"v":300,"d":"$300.00"}},null,"COLIFLOR",null,"QUESO"]
[null,{"$f":"'MATERIA PRIMA Y MATERIALES'!D29","v":"1.1.04.20"},{"$f":"IF(MID('M20'!B5,1,1)=\"#\",\"\",'M20'!B5)","v":"EQUIPO DE SONIDO SONY"},{"$f":"'M20'!J10","v":1},{"$f":"'M20'!L10","v":{"v":130,"d":"$130.00"}},null,"COMINO ",null,"QUINOA"]
[null,{"$f":"'MATERIA PRIMA Y MATERIALES'!D30","v":"1.1.04.21"},{"$f":"IF(MID('M21'!B5,1,1)=\"#\",\"\",'M21'!B5)","v":"MESAS  2 METROS"},{"$f":"'M21'!J10","v":28},{"$f":"'M21'!L10","v":{"v":1680,"d":"$1,680.00"}},null,"CORVINA",null,"RABANO"]
[null,{"$f":"'MATERIA PRIMA Y MATERIALES'!D31","v":"1.1.04.22"},{"$f":"IF(MID('M22'!B5,1,1)=\"#\",\"\",'M22'!B5)","v":"MESAS 1 METRO"},{"$f":"'M22'!J10","v":10},{"$f":"'M22'!L10","v":{"v":400,"d":"$400.00"}},null,"CREMA DE LECHE",null,"REMOLACHA"]
[null,{"$f":"'MATERIA PRIMA Y MATERIALES'!D32","v":"1.1.04.23"},{"$f":"IF(MID('M23'!B5,1,1)=\"#\",\"\",'M23'!B5)","v":"SILLAS NEGRAS"},{"$f":"'M23'!J10","v":300},{"$f":"'M23'!L10","v":{"v":3900,"d":"$3,900.00"}},null,"CULANTRO",null,"SAL "]
[null,{"$f":"'MATERIA PRIMA Y MATERIALES'!D33","v":"1.1.04.24"},{"$f":"IF(MID('M24'!B5,1,1)=\"#\",\"\",'M24'!B5)","v":"MANTELES MANTECA  M/2m"},{"$f":"'M24'!J10","v":48},{"$f":"'M24'!L10","v":{"v":720,"d":"$720.00"}},null,"FIDEOS",null,"SALCHICHAS"]
[null,{"$f":"'MATERIA PRIMA Y MATERIALES'!D34","v":"1.1.04.25"},{"$f":"IF(MID('M25'!B5,1,1)=\"#\",\"\",'M25'!B5)","v":"SOBREMANTELES AMARILLOS"},{"$f":"'M25'!J10","v":30},{"$f":"'M25'!L10","v":{"v":90,"d":"$90.00"}},null,"FREJOL",null,"SALSA CHINA"]
[null,{"$f":"'MATERIA PRIMA Y MATERIALES'!D35","v":"1.1.04.26"},{"$f":"IF(MID('M26'!B5,1,1)=\"#\",\"\",'M26'!B5)","v":"SOBREMANTELES ROJOS"},{"$f":"'M26'!J10","v":30},{"$f":"'M26'!L10","v":{"v":90,"d":"$90.00"}},null,"GUANABANA",null,"SALSA INGLESA"]
[null,{"$f":"'MATERIA PRIMA Y MATERIALES'!D36","v":"1.1.04.27"},{"$f":"IF(MID('M27'!B5,1,1)=\"#\",\"\",'M27'!B5)","v":"SOBREMANTELES DORADOS"},{"$f":"'M27'!J10","v":30},{"$f":"'M27'!L10","v":{"v":90,"d":"$90.00"}},null,"GUAYABA",null,"SANDIA"]
[null,{"$f":"'MATERIA PRIMA Y MATERIALES'!D37","v":"1.1.04.28"},{"$f":"IF(MID('M28'!B5,1,1)=\"#\",\"\",'M28'!B5)","v":"SOBREMANTELES ROSADOS"},{"$f":"'M28'!J10","v":25},{"$f":"'M28'!L10","v":{"v":75,"d":"$75.00"}},null,"HABAS",null,"SANGRE"]
[null,{"$f":"'MATERIA PRIMA Y MATERIALES'!D38","v":"1.1.04.29"},{"$f":"IF(MID('M29'!B5,1,1)=\"#\",\"\",'M29'!B5)","v":"MANTELES COLORES M/1m"},{"$f":"'M29'!J10","v":10},{"$f":"'M29'!L10","v":{"v":60,"d":"$60.00"}},null,"HARINA",null,"TALLARIN"]
[null,{"$f":"'MATERIA PRIMA Y MATERIALES'!D39","v":"1.1.04.30"},{"$f":"IF(MID('M30'!B5,1,1)=\"#\",\"\",'M30'!B5)","v":"VIDRIOS  M/1m"},{"$f":"'M30'!J10","v":10},{"$f":"'M30'!L10","v":{"v":100,"d":"$100.00"}},null,"HIERBA LUISA",null,"TOMATE DE ARBOL"]
[null,{"$f":"'MATERIA PRIMA Y MATERIALES'!D40","v":"1.1.04.31"},{"$f":"IF(MID('M31'!B5,1,1)=\"#\",\"\",'M31'!B5)","v":"SALEROS"},{"$f":"'M31'!J10","v":15},{"$f":"'M31'!L10","v":{"v":4.5,"d":"$4.50"}},null,"HIGADO",null,"TOMATE RIÑON"]
[null,{"$f":"'MATERIA PRIMA Y MATERIALES'!D41","v":"1.1.04.32"},{"$f":"IF(MID('M32'!B5,1,1)=\"#\",\"\",'M32'!B5)","v":"CAJAS PARA CUBIERTOS "},{"$f":"'M32'!J10","v":14},{"$f":"'M32'!L10","v":{"v":14,"d":"$14.00"}},null,"HUEVOS",null,"TOSINO"]
[null,{"$f":"'MATERIA PRIMA Y MATERIALES'!D42","v":"1.1.04.33"},{"$f":"IF(MID('M33'!B5,1,1)=\"#\",\"\",'M33'!B5)","v":"BAR"},{"$f":"'M33'!J10","v":1},{"$f":"'M33'!L10","v":{"v":150,"d":"$150.00"}}]
[{"$nulls":4},{"$f":"SUM(E11:E43)","v":{"v":13526.5,"d":"$13,526.50"}}]
[{"$nulls":3},"TIEMPO  DEP."]
[{"$nulls":3},5,"AÑOS"]
[{"$nulls":3},0,"MESES"]
[{"$nulls":3},{"$f":"((E44/10)/12)*((D46*12)+D47)","v":{"v":6763.250000000001,"d":"$6,763.25"}}]
[]
[]
[null,"1.1.04.34",{"$f":"IF(MID('M34'!B5,1,1)=\"#\",\"\",'M34'!B5)","v":"CUCHARAS"},{"$f":"'M34'!J10","v":300},{"$f":"'M34'!L10","v":{"v":105,"d":"$105.00"}},null,"LECHE",null,"VERDE"]
[null,"1.1.04.35",{"$f":"IF(MID('M35'!B5,1,1)=\"#\",\"\",'M35'!B5)","v":"CUCHILLOS DE MESA"},{"$f":"'M35'!J10","v":250},{"$f":"'M35'!L10","v":{"v":150,"d":"$150.00"}},null,"LECHUGA",null,"YERBA BUENA"]
[null,"1.1.04.36",{"$f":"IF(MID('M36'!B5,1,1)=\"#\",\"\",'M36'!B5)","v":"CUHARILLAS"},{"$f":"'M36'!J10","v":135},{"$f":"'M36'!L10","v":{"v":40.5,"d":"$40.50"}},null,"LENGUA",null,"YUCA"]
[null,"1.1.04.37",{"$f":"IF(MID('M37'!B5,1,1)=\"#\",\"\",'M37'!B5)","v":"CUCHILLOS DE COCINA"},{"$f":"'M37'!J10","v":18},{"$f":"'M37'!L10","v":{"v":45,"d":"$45.00"}},{"$nulls":3},"ZANAHORIA BLANCA"]
[null,"1.1.04.38",{"$f":"IF(MID('M38'!B5,1,1)=\"#\",\"\",'M38'!B5)","v":"CUCHARETAS"},{"$f":"'M38'!J10","v":10},{"$f":"'M38'!L10","v":{"v":35,"d":"$35.00"}},{"$nulls":3},"ZANAHORIA AMARILLA"]
[null,"1.1.04.39",{"$f":"IF(MID('M39'!B5,1,1)=\"#\",\"\",'M39'!B5)","v":"CUCHARONES"},{"$f":"'M39'!J10","v":4},{"$f":"'M39'!L10","v":{"v":32,"d":"$32.00"}}]
[null,"1.1.04.40",{"$f":"IF(MID('M40'!B5,1,1)=\"#\",\"\",'M40'!B5)","v":"DIABLO"},{"$f":"'M40'!J10","v":4},{"$f":"'M40'!L10","v":{"v":24,"d":"$24.00"}}]
[null,"1.1.04.41",{"$f":"IF(MID('M41'!B5,1,1)=\"#\",\"\",'M41'!B5)","v":"PLATO SOPERO"},{"$f":"'M41'!J10","v":240},{"$f":"'M41'!L10","v":{"v":192,"d":"$192.00"}}]
[null,"1.1.04.42",{"$f":"IF(MID('M42'!B5,1,1)=\"#\",\"\",'M42'!B5)","v":"PLATO FUERTE"},{"$f":"'M42'!J10","v":220},{"$f":"'M42'!L10","v":{"v":286,"d":"$286.00"}}]
[null,"1.1.04.43",{"$f":"IF(MID('M43'!B5,1,1)=\"#\",\"\",'M43'!B5)","v":"PLATO ENTRADA"},{"$f":"'M43'!J10","v":230},{"$f":"'M43'!L10","v":{"v":161,"d":"$161.00"}}]
[null,"1.1.04.44",{"$f":"IF(MID('M44'!B5,1,1)=\"#\",\"\",'M44'!B5)","v":"PLATO POSTRE"},{"$f":"'M44'!J10","v":50},{"$f":"'M44'!L10","v":{"v":25,"d":"$25.00"}}]
[null,"1.1.04.45",{"$f":"IF(MID('M45'!B5,1,1)=\"#\",\"\",'M45'!B5)","v":"VASO"},{"$f":"'M45'!J10","v":120},{"$f":"'M45'!L10","v":{"v":96,"d":"$96.00"}}]
[null,"1.1.04.46",{"$f":"IF(MID('M46'!B5,1,1)=\"#\",\"\",'M46'!B5)","v":"COPA DE AGUA"},{"$f":"'M46'!J10","v":50},{"$f":"'M46'!L10","v":{"v":60,"d":"$60.00"}}]
[null,"1.1.04.47",{"$f":"IF(MID('M47'!B5,1,1)=\"#\",\"\",'M47'!B5)","v":"COPA DE VINO"},{"$f":"'M47'!J10","v":95},{"$f":"'M47'!L10","v":{"v":28.5,"d":"$28.50"}}]
[null,"1.1.04.48",{"$f":"IF(MID('M48'!B5,1,1)=\"#\",\"\",'M48'!B5)","v":"CENICEROS"},{"$f":"'M48'!J10","v":25},{"$f":"'M48'!L10","v":{"v":20,"d":"$20.00"}}]
[null,"1.1.04.49",{"$f":"IF(MID('M49'!B5,1,1)=\"#\",\"\",'M49'!B5)","v":"TENEDORES"},{"$f":"'M49'!J10","v":250},{"$f":"'M49'!L10","v":{"v":100,"d":"$100.00"}}]
[{"$nulls":4},{"$f":"SUM(E51:E66)","v":{"v":1400,"d":"$1,400.00"}}]
[{"$nulls":3},"TIEMPO  DEP."]
[{"$nulls":3},1,"AÑOS"]
[{"$nulls":3},0,"MESES"]
[{"$nulls":3},{"$f":"((E67/3)/12)*((D69*12)+D70)","v":{"v":466.66666666666674,"d":"$466.67"}}]
[]
[]
[]
[null,"1.1.04.50","SERVILLETAS  PAQUETES",{"$f":"'M50'!J10","v":391},{"$f":"'M50'!L10","v":{"v":117.3,"d":"$117.30"}}]
[null,"1.1.04.51","CONTRATOS",{"$f":"'M52'!J10","v":396},{"$f":"'M52'!L10","v":{"v":99,"d":"$99.00"}}]

{"sheet":"REPORTES","index":79,"n_rows":12,"n_cols":10,"rows_kept":12,"merged":[[0,0,0,8],[2,0,2,8],[5,2,5,3],[7,0,8,0],[7,1,8,1],[7,2,8,2],[7,3,7,5],[7,6,7,8],[11,3,11,4],[11,6,11,7]]}
["RESTAURANTE CAMINOS DE HERRADURA"]
[]
["REPORTE DE INGRESOS Y REQUISICIONES"]
[]
["Unidad de medida:",null,"LIBRAS"]
["Fecha de Corte:",null,{"$f":"NOW()","v":"2010-06-10T17:05:11.150"}]
[]
["FECHA","ORDEN DE \nPRODUCCIÓN","DETALLE","ENTRADAS",null,null,"SALIDAS"]
[{"$nulls":3},"CANT.","P.U.","P.T.","CANT.","P.U.","P.T."]
[]
[]
[{"$nulls":3},"TOTAL",null,{"$f":"SUM(F10:F11)","v":0},"TOTAL",null,{"$f":"SUM(I10:I11)","v":0},{"$f":"F12-I12","v":0}]