{"text_format":"3","workbook":"xlsx","n_sheets":80,"sheets":["INVENTARIOS","MATERIA PRIMA Y MATERIALES","M1","M2","M3","M4","M5","M6","M7","M8","M9","M10","M11","M12","M13","M14","M15","M16","M17","M18","M19","M20","M21","M22","M23","M24","M25","M26","M27","M28","M29","M30","M31","M32","M33","M34","M35","M36","M37","M38","M39","M40","M41","M42","M43","M44","M45","M46","M47","M48","M49","M50","M51","M52","M53","S1","S2","S3","S4","S5","S6","S7","S8","S9","S10","S11","S12","S13","S14","S15","S16","S17","S18","S19","S20","S21","S22","S23","INFORME DE INVENTARIOS","REPORTES"],"not_rendered":{"images":1,"macros":1,"defined_names":6},"unopened":[{"sheet":"INVENTARIOS","index":0,"reason":"not_a_worksheet"}],"read":"whole","date_system":"1900"}

{"sheet":"MATERIA PRIMA Y MATERIALES","index":1,"n_rows":62,"n_cols":5,"rows_kept":62,"merged":[[0,0,0,12],[2,0,2,12]]}
["RESTAURANTE CAMINOS DE HERRADURA"]
[]
["INVENTARIOS"]
[]
[]
[]
[]
[]
[{"$nulls":3},"CODIGO","MATERIA PRIMA"]
[{"$nulls":3},"1.1.04.01","ARROZ"]
[{"$nulls":3},"1.1.04.02","ACEITE"]
[{"$nulls":3},"1.1.04.03","AZUCAR"]
[{"$nulls":3},"1.1.04.04","LOMO"]
[{"$nulls":3},"1.1.04.05","PAPAS"]
[{"$nulls":3},"1.1.04.06","POLLO"]
[{"$nulls":3},"1.1.04.07","#'M7'!A1"]
[{"$nulls":3},"1.1.04.08","#'M8'!A1"]
[{"$nulls":3},"1.1.04.09","#'M9'!A1"]
[{"$nulls":3},"1.1.04.10","#'M10'!A1"]
[{"$nulls":3},"1.1.04.11","#'M11'!A1"]
[{"$nulls":3},"1.1.04.12","#'M12'!A1"]
[{"$nulls":3},"1.1.04.13","#'M13'!A1"]
[{"$nulls":3},"1.1.04.14","#'M14'!A1"]
[{"$nulls":3},"1.1.04.15","#'M15'!A1"]
[{"$nulls":3},"1.1.04.16","#'M16'!A1"]
[{"$nulls":3},"1.1.04.17","#'M17'!A1"]
[{"$nulls":3},"1.1.04.18","#'M18'!A1"]
[{"$nulls":3},"1.1.04.19","#'M19'!A1"]
[{"$nulls":3},"1.1.04.20","#'M20'!A1"]
[{"$nulls":3},"1.1.04.21","#'M21'!A1"]
[{"$nulls":3},"1.1.04.22","#'M22'!A1"]
[{"$nulls":3},"1.1.04.23","#'M23'!A1"]
[{"$nulls":3},"1.1.04.24","#'M24'!A1"]
[{"$nulls":3},"1.1.04.25","#'M25'!A1"]
[{"$nulls":3},"1.1.04.26","#'M26'!A1"]
[{"$nulls":3},"1.1.04.27","#'M27'!A1"]
[{"$nulls":3},"1.1.04.28","#'M28'!A1"]
[{"$nulls":3},"1.1.04.29","#'M29'!A1"]
[{"$nulls":3},"1.1.04.30","#'M30'!A1"]
[{"$nulls":3},"1.1.04.31","#'M31'!A1"]
[{"$nulls":3},"1.1.04.32","#'M32'!A1"]
[{"$nulls":3},"1.1.04.33","#'M33'!A1"]
[{"$nulls":3},"1.1.04.34","#'M34'!A1"]
[{"$nulls":3},"1.1.04.35","#'M35'!A1"]
[{"$nulls":3},"1.1.04.36","#'M36'!A1"]
[{"$nulls":3},"1.1.04.37","#'M37'!A1"]
[{"$nulls":3},"1.1.04.38","#'M38'!A1"]
[{"$nulls":3},"1.1.04.39","#'M39'!A1"]
[{"$nulls":3},"1.1.04.40","#'M40'!A1"]
[{"$nulls":3},"1.1.04.41","#'M41'!A1"]
[{"$nulls":3},"1.1.04.42","#'M42'!A1"]
[{"$nulls":3},"1.1.04.43","#'M43'!A1"]
[{"$nulls":3},"1.1.04.44","#'M44'!A1"]
[{"$nulls":3},"1.1.04.45","#'M45'!A1"]
[{"$nulls":3},"1.1.04.46","#'M46'!A1"]
[{"$nulls":3},"1.1.04.47","#'M47'!A1"]
[{"$nulls":3},"1.1.04.48","#'M48'!A1"]
[{"$nulls":3},"1.1.04.49","#'M49'!A1"]
[{"$nulls":3},"1.1.04.50","#'M50'!A1"]
[{"$nulls":3},"1.1.04.51","#'M51'!A1"]
[{"$nulls":3},"1.1.04.52","#'M52'!A1"]
[{"$nulls":3},"1.1.04.53","#'M53'!A1"]

{"sheet":"M1","index":2,"n_rows":12,"n_cols":13,"rows_kept":12,"merged":[[0,0,0,12],[2,0,2,12],[5,6,5,7],[7,0,8,0],[7,1,8,1],[7,2,8,2],[7,3,7,5],[7,6,7,8],[7,9,7,11],[7,12,8,12]]}
["RESTAURANTE CAMINOS DE HERRADURA"]
[]
["KARDEX"]
[]
["Artículo:",{"$f":"'MATERIA PRIMA Y MATERIALES'!E10","v":"ARROZ"},null,null,"Unidad de medida:",null,"libras",null,"Codigo:",{"$f":"'MATERIA PRIMA Y MATERIALES'!D10","v":"1.1.04.01"}]
["Método:","PROMEDIO PONDERADO",null,null,"Fecha de Corte:",null,{"$f":"NOW()","v":"2010-06-10T17:02:54.760"}]
[]
["FECHA","ORDEN DE \nPRODUCCIÓN","DETALLE",{"$nulls":6},"EXISTENCIAS",null,null,"RESPONSABLE"]
[{"$nulls":3},"CANT.","P.U.","P.T.","CANT.","P.U.","P.T.","CANT.","P.U.","P.T."]
[{"$nulls":9},79.8,{"v":0.35,"d":"$0.35"},{"v":27.929999999999996,"d":"$27.93"}]
[]
["2010-02-01",null,"SITUACIÓN INICIAL",79.8,{"v":0.35,"d":"$0.35"},{"$f":"$D$12*$E$12","v":{"v":27.929999999999996,"d":"$27.93"}},{"$nulls":3},{"$f":"J13+D12","v":79.8},{"$f":"$L$12/$J$12","v":{"v":0.35,"d":"$0.35"}},{"$f":"L13+F12","v":{"v":27.929999999999996,"d":"$27.93"}}]

{"sheet":"M2","index":3,"n_rows":12,"n_cols":13,"rows_kept":12,"merged":[[0,0,0,12],[2,0,2,12],[5,6,5,7],[7,0,8,0],[7,1,8,1],[7,2,8,2],[7,3,7,5],[7,6,7,8],[7,9,7,11],[7,12,8,12]]}
["RESTAURANTE CAMINOS DE HERRADURA"]
[]
["KARDEX"]
[]
["Artículo:",{"$f":"'MATERIA PRIMA Y MATERIALES'!E11","v":"ACEITE"},null,null,"Unidad de medida:",null,"LIBRAS",null,"Codigo:",{"$f":"'MATERIA PRIMA Y MATERIALES'!D11","v":"1.1.04.02"}]
["Método:","PROMEDIO PONDERADO",null,null,"Fecha de Corte:",null,{"$f":"NOW()","v":"2010-06-10T17:02:54.760"}]
[]
["FECHA","ORDEN DE \nPRODUCCIÓN","DETALLE",{"$nulls":6},"EXISTENCIAS",null,null,"RESPONSABLE"]
[{"$nulls":3},"CANT.","P.U.","P.T.","CANT.","P.U.","P.T.","CANT.","P.U.","P.T."]
[{"$nulls":9},65,{"v":0.76,"d":"$0.76"},{"v":49.4,"d":"$49.40"}]
[]
["2010-02-01",null,"SITUACIÓN INICIAL",65,{"v":0.76,"d":"$0.76"},{"$f":"$D$12*$E$12","v":{"v":49.4,"d":"$49.40"}},{"$nulls":3},{"$f":"J13+D12","v":65},{"$f":"$L$12/$J$12","v":{"v":0.76,"d":"$0.76"}},{"$f":"L13+F12","v":{"v":49.4,"d":"$49.40"}}]

{"sheet":"M3","index":4,"n_rows":12,"n_cols":13,"rows_kept":12,"merged":[[0,0,0,12],[2,0,2,12],[5,6,5,7],[7,0,8,0],[7,1,8,1],[7,2,8,2],[7,3,7,5],[7,6,7,8],[7,9,7,11],[7,12,8,12]]}
["RESTAURANTE CAMINOS DE HERRADURA"]
[]
["KARDEX"]
[]
["Artículo:",{"$f":"'MATERIA PRIMA Y MATERIALES'!E12","v":"AZUCAR"},null,null,"Unidad de medida:",null,"LIBRAS",null,"Codigo:",{"$f":"'MATERIA PRIMA Y MATERIALES'!D12","v":"1.1.04.03"}]
["Método:","PROMEDIO PONDERADO",null,null,"Fecha de Corte:",null,{"$f":"NOW()","v":"2010-06-10T17:02:54.760"}]
[]
["FECHA","ORDEN DE \nPRODUCCIÓN","DETALLE","ENTRADAS",null,null,"SALIDAS",null,null,"EXISTENCIAS",null,null,"RESPONSABLE"]
[{"$nulls":3},"CANT.","P.U.","P.T.","CANT.","P.U.","P.T.","CANT.","P.U.","P.T."]
[{"$nulls":9},50.5,{"v":0.32999999999999996,"d":"$0.33"},{"v":16.665,"d":"$16.67"}]
[]
["2010-02-01",null,"SITUACIÓN INICIAL",50.5,{"v":0.33,"d":"$0.33"},{"$f":"$D$12*$E$12","v":{"v":16.665,"d":"$16.67"}},{"$nulls":3},{"$f":"J13+D12","v":50.5},{"$f":"$L$12/$J$12","v":{"v":0.32999999999999996,"d":"$0.33"}},{"$f":"L13+F12","v":{"v":16.665,"d":"$16.67"}}]

{"sheet":"M4","index":5,"n_rows":12,"n_cols":13,"rows_kept":12,"merged":[[0,0,0,12],[2,0,2,12],[5,6,5,7],[7,0,8,0],[7,1,8,1],[7,2,8,2],[7,3,7,5],[7,6,7,8],[7,9,7,11],[7,12,8,12]]}
["RESTAURANTE CAMINOS DE HERRADURA"]
[]
["KARDEX"]
[]
["Artículo:",{"$f":"'MATERIA PRIMA Y MATERIALES'!E13","v":"LOMO"},null,null,"Unidad de medida:",null,"LIBRAS",null,"Codigo:",{"$f":"'MATERIA PRIMA Y MATERIALES'!D13","v":"1.1.04.04"}]
["Método:","PROMEDIO PONDERADO",null,null,"Fecha de Corte:",null,{"$f":"NOW()","v":"2010-06-10T17:02:54.760"}]
[]
["FECHA","ORDEN DE \nPRODUCCIÓN","DETALLE",{"$nulls":6},"EXISTENCIAS",null,null,"RESPONSABLE"]
[{"$nulls":3},"CANT.","P.U.","P.T.","CANT.","P.U.","P.T.","CANT.","P.U.","P.T."]
[{"$nulls":9},11,{"v":2,"d":"$2.00"},{"v":22,"d":"$22.00"}]
[]
["2010-02-01",null,"SITUACIÓN INICIAL",11,{"v":2,"d":"$2.00"},{"$f":"$D$12*$E$12","v":{"v":22,"d":"$22.00"}},{"$nulls":3},{"$f":"J13+D12","v":11},{"$f":"$L$12/$J$12","v":{"v":2,"d":"$2.00"}},{"$f":"L13+F12","v":{"v":22,"d":"$22.00"}}]

{"sheet":"M5","index":6,"n_rows":12,"n_cols":13,"rows_kept":12,"merged":[[0,0,0,12],[2,0,2,12],[5,6,5,7],[7,0,8,0],[7,1,8,1],[7,2,8,2],[7,3,7,5],[7,6,7,8],[7,9,7,11],[7,12,8,12]]}
["RESTAURANTE CAMINOS DE HERRADURA"]
[]
["KARDEX"]
[]
["Artículo:",{"$f":"'MATERIA PRIMA Y MATERIALES'!E14","v":"PAPAS"},null,null,"Unidad de medida:",null,"LIBRAS",null,"Codigo:",{"$f":"'MATERIA PRIMA Y MATERIALES'!D14","v":"1.1.04.05"}]
["Método:","PROMEDIO PONDERADO",null,null,"Fecha de Corte:",null,{"$f":"NOW()","v":"2010-06-10T17:02:54.760"}]
[]
["FECHA","ORDEN DE \nPRODUCCIÓN","DETALLE",{"$nulls":6},"EXISTENCIAS",null,null,"RESPONSABLE"]
[{"$nulls":3},"CANT.","P.U.","P.T.","CANT.","P.U.","P.T.","CANT.","P.U.","P.T."]
[{"$nulls":9},200,{"v":0.12,"d":"$0.12"},{"v":24,"d":"$24.00"}]
[]
["2010-02-01",null,"SITUACIÓN INICIAL",200,{"v":0.12,"d":"$0.12"},{"$f":"$D$12*$E$12","v":{"v":24,"d":"$24.00"}},{"$nulls":3},{"$f":"J13+D12","v":200},{"$f":"$L$12/$J$12","v":{"v":0.12,"d":"$0.12"}},{"$f":"L13+F12","v":{"v":24,"d":"$24.00"}}]

{"sheet":"M6","index":7,"n_rows":9,"n_cols":13,"rows_kept":9,"merged":[[0,0,0,12],[2,0,2,12],[5,6,5,7],[7,0,8,0],[7,1,8,1],[7,2,8,2],[7,3,7,5],[7,6,7,8],[7,9,7,11],[7,12,8,12]]}
["RESTAURANTE CAMINOS DE HERRADURA"]
[]
["KARDEX"]
[]
["Artículo:",{"$f":"'MATERIA PRIMA Y MATERIALES'!E15","v":"POLLO"},null,null,"Unidad de medida:",null,"LIBRAS",null,"Codigo:",{"$f":"'MATERIA PRIMA Y MATERIALES'!D15","v":"1.1.04.06"}]
["Método:","PROMEDIO PONDERADO",null,null,"Fecha de Corte:",null,{"$f":"NOW()","v":"2010-06-10T17:02:54.760"}]
[]
["FECHA","ORDEN DE \nPRODUCCIÓN","DETALLE",{"$nulls":6},"EXISTENCIAS",null,null,"RESPONSABLE"]
[{"$nulls":3},"CANT.","P.U.","P.T.","CANT.","P.U.","P.T.","CANT.","P.U.","P.T."]

{"sheet":"M7","index":8,"n_rows":9,"n_cols":13,"rows_kept":9,"merged":[[0,0,0,12],[2,0,2,12],[5,6,5,7],[7,0,8,0],[7,1,8,1],[7,2,8,2],[7,3,7,5],[7,6,7,8],[7,9,7,11],[7,12,8,12]]}
["RESTAURANTE CAMINOS DE HERRADURA"]
[]
["KARDEX"]
[]
["Artículo:",{"$f":"'MATERIA PRIMA Y MATERIALES'!E16","v":"#'M7'!A1"},null,null,"Unidad de medida:",null,"LIBRAS",null,"Codigo:",{"$f":"'MATERIA PRIMA Y MATERIALES'!D16","v":"1.1.04.07"}]
["Método:","PROMEDIO PONDERADO",null,null,"Fecha de Corte:",null,{"$f":"NOW()","v":"2010-06-10T17:02:54.760"}]
[]
["FECHA","ORDEN DE \nPRODUCCIÓN","DETALLE",{"$nulls":6},"EXISTENCIAS",null,null,"RESPONSABLE"]
[{"$nulls":3},"CANT.","P.U.","P.T.","CANT.","P.U.","P.T.","CANT.","P.U.","P.T."]

{"sheet":"M8","index":9,"n_rows":9,"n_cols":13,"rows_kept":9,"merged":[[0,0,0,12],[2,0,2,12],[5,6,5,7],[7,0,8,0],[7,1,8,1],[7,2,8,2],[7,3,7,5],[7,6,7,8],[7,9,7,11],[7,12,8,12]]}
["RESTAURANTE CAMINOS DE HERRADURA"]
[]
["KARDEX"]
[]
["Artículo:",{"$f":"'MATERIA PRIMA Y MATERIALES'!E17","v":"#'M8'!A1"},null,null,"Unidad de medida:",null,"LIBRAS",null,"Codigo:",{"$f":"'MATERIA PRIMA Y MATERIALES'!D17","v":"1.1.04.08"}]
["Método:","PROMEDIO PONDERADO",null,null,"Fecha de Corte:",null,{"$f":"NOW()","v":"2010-06-10T17:02:54.760"}]
[]
["FECHA","ORDEN DE \nPRODUCCIÓN","DETALLE",{"$nulls":6},"EXISTENCIAS",null,null,"RESPONSABLE"]
[{"$nulls":3},"CANT.","P.U.","P.T.","CANT.","P.U.","P.T.","CANT.","P.U.","P.T."]

{"sheet":"M9","index":10,"n_rows":9,"n_cols":13,"rows_kept":9,"merged":[[0,0,0,12],[2,0,2,12],[5,6,5,7],[7,0,8,0],[7,1,8,1],[7,2,8,2],[7,3,7,5],[7,6,7,8],[7,9,7,11],[7,12,8,12]]}
["RESTAURANTE CAMINOS DE HERRADURA"]
[]
["KARDEX"]
[]
["Artículo:",{"$f":"'MATERIA PRIMA Y MATERIALES'!E18","v":"#'M9'!A1"},null,null,"Unidad de medida:",null,"LIBRAS",null,"Codigo:",{"$f":"'MATERIA PRIMA Y MATERIALES'!D18","v":"1.1.04.09"}]
["Método:","PROMEDIO PONDERADO",null,null,"Fecha de Corte:",null,{"$f":"NOW()","v":"2010-06-10T17:02:54.760"}]
[]
["FECHA","ORDEN DE \nPRODUCCIÓN","DETALLE",{"$nulls":6},"EXISTENCIAS",null,null,"RESPONSABLE"]
[{"$nulls":3},"CANT.","P.U.","P.T.","CANT.","P.U.","P.T.","CANT.","P.U.","P.T."]

{"sheet":"M10","index":11,"n_rows":9,"n_cols":13,"rows_kept":9,"merged":[[0,0,0,12],[2,0,2,12],[5,6,5,7],[7,0,8,0],[7,1,8,1],[7,2,8,2],[7,3,7,5],[7,6,7,8],[7,9,7,11],[7,12,8,12]]}
["RESTAURANTE CAMINOS DE HERRADURA"]
[]
["KARDEX"]
[]
["Artículo:",{"$f":"'MATERIA PRIMA Y MATERIALES'!E19","v":"#'M10'!A1"},null,null,"Unidad de medida:",null,"LIBRAS",null,"Codigo:",{"$f":"'MATERIA PRIMA Y MATERIALES'!D19","v":"1.1.04.10"}]
["Método:","PROMEDIO PONDERADO",null,null,"Fecha de Corte:",null,{"$f":"NOW()","v":"2010-06-10T17:02:54.760"}]
[]
["FECHA","ORDEN DE \nPRODUCCIÓN","DETALLE",{"$nulls":6},"EXISTENCIAS",null,null,"RESPONSABLE"]
[{"$nulls":3},"CANT.","P.U.","P.T.","CANT.","P.U.","P.T.","CANT.","P.U.","P.T."]

{"sheet":"M11","index":12,"n_rows":9,"n_cols":13,"rows_kept":9,"merged":[[0,0,0,12],[2,0,2,12],[5,6,5,7],[7,0,8,0],[7,1,8,1],[7,2,8,2],[7,3,7,5],[7,6,7,8],[7,9,7,11],[7,12,8,12]]}
["RESTAURANTE CAMINOS DE HERRADURA"]
[]
["KARDEX"]
[]
["Artículo:",{"$f":"'MATERIA PRIMA Y MATERIALES'!E20","v":"#'M11'!A1"},null,null,"Unidad de medida:",null,"LIBRAS",null,"Codigo:",{"$f":"'MATERIA PRIMA Y MATERIALES'!D20","v":"1.1.04.11"}]
["Método:","PROMEDIO PONDERADO",null,null,"Fecha de Corte:",null,{"$f":"NOW()","v":"2010-06-10T17:02:54.760"}]
[]
["FECHA","ORDEN DE \nPRODUCCIÓN","DETALLE",{"$nulls":6},"EXISTENCIAS",null,null,"RESPONSABLE"]
[{"$nulls":3},"CANT.","P.U.","P.T.","CANT.","P.U.","P.T.","CANT.","P.U.","P.T."]

{"sheet":"M12","index":13,"n_rows":9,"n_cols":13,"rows_kept":9,"merged":[[0,0,0,12],[2,0,2,12],[5,6,5,7],[7,0,8,0],[7,1,8,1],[7,2,8,2],[7,3,7,5],[7,6,7,8],[7,9,7,11],[7,12,8,12]]}
["RESTAURANTE CAMINOS DE HERRADURA"]
[]
["KARDEX"]
[]
["Artículo:",{"$f":"'MATERIA PRIMA Y MATERIALES'!E21","v":"#'M12'!A1"},null,null,"Unidad de medida:",null,"LIBRAS",null,"Codigo:",{"$f":"'MATERIA PRIMA Y MATERIALES'!D21","v":"1.1.04.12"}]
["Método:","PROMEDIO PONDERADO",null,null,"Fecha de Corte:",null,{"$f":"NOW()","v":"2010-06-10T17:02:54.760"}]
[]
["FECHA","ORDEN DE \nPRODUCCIÓN","DETALLE",{"$nulls":6},"EXISTENCIAS",null,null,"RESPONSABLE"]
[{"$nulls":3},"CANT.","P.U.","P.T.","CANT.","P.U.","P.T.","CANT.","P.U.","P.T."]

{"sheet":"M13","index":14,"n_rows":9,"n_cols":13,"rows_kept":9,"merged":[[0,0,0,12],[2,0,2,12],[5,6,5,7],[7,0,8,0],[7,1,8,1],[7,2,8,2],[7,3,7,5],[7,6,7,8],[7,9,7,11],[7,12,8,12]]}
["RESTAURANTE CAMINOS DE HERRADURA"]
[]
["KARDEX"]
[]
["Artículo:",{"$f":"'MATERIA PRIMA Y MATERIALES'!E22","v":"#'M13'!A1"},null,null,"Unidad de medida:",null,"LIBRAS",null,"Codigo:",{"$f":"'MATERIA PRIMA Y MATERIALES'!D22","v":"1.1.04.13"}]
["Método:","PROMEDIO PONDERADO",null,null,"Fecha de Corte:",null,{"$f":"NOW()","v":"2010-06-10T17:02:54.760"}]
[]
["FECHA","ORDEN DE \nPRODUCCIÓN","DETALLE",{"$nulls":6},"EXISTENCIAS",null,null,"RESPONSABLE"]
[{"$nulls":3},"CANT.","P.U.","P.T.","CANT.","P.U.","P.T.","CANT.","P.U.","P.T."]

{"sheet":"M14","index":15,"n_rows":9,"n_cols":13,"rows_kept":9,"merged":[[0,0,0,12],[2,0,2,12],[5,6,5,7],[7,0,8,0],[7,1,8,1],[7,2,8,2],[7,3,7,5],[7,6,7,8],[7,9,7,11],[7,12,8,12]]}
["RESTAURANTE CAMINOS DE HERRADURA"]
[]
["KARDEX"]
[]
["Artículo:",{"$f":"'MATERIA PRIMA Y MATERIALES'!E23","v":"#'M14'!A1"},null,null,"Unidad de medida:",null,"LIBRAS",null,"Codigo:",{"$f":"'MATERIA PRIMA Y MATERIALES'!D23","v":"1.1.04.14"}]
["Método:","PROMEDIO PONDERADO",null,null,"Fecha de Corte:",null,{"$f":"NOW()","v":"2010-06-10T17:02:54.760"}]
[]
["FECHA","ORDEN DE \nPRODUCCIÓN","DETALLE",{"$nulls":6},"EXISTENCIAS",null,null,"RESPONSABLE"]
[{"$nulls":3},"CANT.","P.U.","P.T.","CANT.","P.U.","P.T.","CANT.","P.U.","P.T."]

{"sheet":"M15","index":16,"n_rows":9,"n_cols":13,"rows_kept":9,"merged":[[0,0,0,12],[2,0,2,12],[5,6,5,7],[7,0,8,0],[7,1,8,1],[7,2,8,2],[7,3,7,5],[7,6,7,8],[7,9,7,11],[7,12,8,12]]}
["RESTAURANTE CAMINOS DE HERRADURA"]
[]
["KARDEX"]
[]
["Artículo:",{"$f":"'MATERIA PRIMA Y MATERIALES'!E24","v":"#'M15'!A1"},null,null,"Unidad de medida:",null,"LIBRAS",null,"Codigo:",{"$f":"'MATERIA PRIMA Y MATERIALES'!D24","v":"1.1.04.15"}]
["Método:","PROMEDIO PONDERADO",null,null,"Fecha de Corte:",null,{"$f":"NOW()","v":"2010-06-10T17:02:54.760"}]
[]
["FECHA","ORDEN DE \nPRODUCCIÓN","DETALLE",{"$nulls":6},"EXISTENCIAS",null,null,"RESPONSABLE"]
[{"$nulls":3},"CANT.","P.U.","P.T.","CANT.","P.U.","P.T.","CANT.","P.U.","P.T."]

{"sheet":"M16","index":17,"n_rows":9,"n_cols":13,"rows_kept":9,"merged":[[0,0,0,12],[2,0,2,12],[5,6,5,7],[7,0,8,0],[7,1,8,1],[7,2,8,2],[7,3,7,5],[7,6,7,8],[7,9,7,11],[7,12,8,12]]}
["RESTAURANTE CAMINOS DE HERRADURA"]
[]
["KARDEX"]
[]
["Artículo:",{"$f":"'MATERIA PRIMA Y MATERIALES'!E25","v":"#'M16'!A1"},null,null,"Unidad de medida:",null,"LIBRAS",null,"Codigo:",{"$f":"'MATERIA PRIMA Y MATERIALES'!D25","v":"1.1.04.16"}]
["Método:","PROMEDIO PONDERADO",null,null,"Fecha de Corte:",null,{"$f":"NOW()","v":"2010-06-10T17:02:54.760"}]
[]
["FECHA","ORDEN DE \nPRODUCCIÓN","DETALLE",{"$nulls":6},"EXISTENCIAS",null,null,"RESPONSABLE"]
[{"$nulls":3},"CANT.","P.U.","P.T.","CANT.","P.U.","P.T.","CANT.","P.U.","P.T."]

{"sheet":"M17","index":18,"n_rows":9,"n_cols":13,"rows_kept":9,"merged":[[0,0,0,12],[2,0,2,12],[5,6,5,7],[7,0,8,0],[7,1,8,1],[7,2,8,2],[7,3,7,5],[7,6,7,8],[7,9,7,11],[7,12,8,12]]}
["RESTAURANTE CAMINOS DE HERRADURA"]
[]
["KARDEX"]
[]
["Artículo:",{"$f":"'MATERIA PRIMA Y MATERIALES'!E26","v":"#'M17'!A1"},null,null,"Unidad de medida:",null,"LIBRAS",null,"Codigo:",{"$f":"'MATERIA PRIMA Y MATERIALES'!D26","v":"1.1.04.17"}]
["Método:","PROMEDIO PONDERADO",null,null,"Fecha de Corte:",null,{"$f":"NOW()","v":"2010-06-10T17:02:54.760"}]
[]
["FECHA","ORDEN DE \nPRODUCCIÓN","DETALLE",{"$nulls":6},"EXISTENCIAS",null,null,"RESPONSABLE"]
[{"$nulls":3},"CANT.","P.U.","P.T.","CANT.","P.U.","P.T.","CANT.","P.U.","P.T."]

{"sheet":"M18","index":19,"n_rows":9,"n_cols":13,"rows_kept":9,"merged":[[0,0,0,12],[2,0,2,12],[5,6,5,7],[7,0,8,0],[7,1,8,1],[7,2,8,2],[7,3,7,5],[7,6,7,8],[7,9,7,11],[7,12,8,12]]}
["RESTAURANTE CAMINOS DE HERRADURA"]
[]
["KARDEX"]
[]
["Artículo:",{"$f":"'MATERIA PRIMA Y MATERIALES'!E27","v":"#'M18'!A1"},null,null,"Unidad de medida:",null,"LIBRAS",null,"Codigo:",{"$f":"'MATERIA PRIMA Y MATERIALES'!D27","v":"1.1.04.18"}]
["Método:","PROMEDIO PONDERADO",null,null,"Fecha de Corte:",null,{"$f":"NOW()","v":"2010-06-10T17:02:54.760"}]
[]
["FECHA","ORDEN DE \nPRODUCCIÓN","DETALLE",{"$nulls":6},"EXISTENCIAS",null,null,"RESPONSABLE"]
[{"$nulls":3},"CANT.","P.U.","P.T.","CANT.","P.U.","P.T.","CANT.","P.U.","P.T."]

{"sheet":"M19","index":20,"n_rows":9,"n_cols":13,"rows_kept":9,"merged":[[0,0,0,12],[2,0,2,12],[5,6,5,7],[7,0,8,0],[7,1,8,1],[7,2,8,2],[7,3,7,5],[7,6,7,8],[7,9,7,11],[7,12,8,12]]}
["RESTAURANTE CAMINOS DE HERRADURA"]
[]
["KARDEX"]
[]
["Artículo:",{"$f":"'MATERIA PRIMA Y MATERIALES'!E28","v":"#'M19'!A1"},null,null,"Unidad de medida:",null,"LIBRAS",null,"Codigo:",{"$f":"'MATERIA PRIMA Y MATERIALES'!D28","v":"1.1.04.19"}]
["Método:","PROMEDIO PONDERADO",null,null,"Fecha de Corte:",null,{"$f":"NOW()","v":"2010-06-10T17:02:54.760"}]
[]
["FECHA","ORDEN DE \nPRODUCCIÓN","DETALLE",{"$nulls":6},"EXISTENCIAS",null,null,"RESPONSABLE"]
[{"$nulls":3},"CANT.","P.U.","P.T.","CANT.","P.U.","P.T.","CANT.","P.U.","P.T."]

{"sheet":"M20","index":21,"n_rows":9,"n_cols":13,"rows_kept":9,"merged":[[0,0,0,12],[2,0,2,12],[5,6,5,7],[7,0,8,0],[7,1,8,1],[7,2,8,2],[7,3,7,5],[7,6,7,8],[7,9,7,11],[7,12,8,12]]}
["RESTAURANTE CAMINOS DE HERRADURA"]
[]
["KARDEX"]
[]
["Artículo:",{"$f":"'MATERIA PRIMA Y MATERIALES'!E29","v":"#'M20'!A1"},null,null,"Unidad de medida:",null,"LIBRAS",null,"Codigo:",{"$f":"'MATERIA PRIMA Y MATERIALES'!D29","v":"1.1.04.20"}]
["Método:","PROMEDIO PONDERADO",null,null,"Fecha de Corte:",null,{"$f":"NOW()","v":"2010-06-10T17:02:54.760"}]
[]
["FECHA","ORDEN DE \nPRODUCCIÓN","DETALLE",{"$nulls":6},"EXISTENCIAS",null,null,"RESPONSABLE"]
[{"$nulls":3},"CANT.","P.U.","P.T.","CANT.","P.U.","P.T.","CANT.","P.U.","P.T."]

{"sheet":"M21","index":22,"n_rows":9,"n_cols":13,"rows_kept":9,"merged":[[0,0,0,12],[2,0,2,12],[5,6,5,7],[7,0,8,0],[7,1,8,1],[7,2,8,2],[7,3,7,5],[7,6,7,8],[7,9,7,11],[7,12,8,12]]}
["RESTAURANTE CAMINOS DE HERRADURA"]
[]
["KARDEX"]
[]
["Artículo:",{"$f":"'MATERIA PRIMA Y MATERIALES'!E30","v":"#'M21'!A1"},null,null,"Unidad de medida:",null,"LIBRAS",null,"Codigo:",{"$f":"'MATERIA PRIMA Y MATERIALES'!D30","v":"1.1.04.21"}]
["Método:","PROMEDIO PONDERADO",null,null,"Fecha de Corte:",null,{"$f":"NOW()","v":"2010-06-10T17:02:54.760"}]
[]
["FECHA","ORDEN DE \nPRODUCCIÓN","DETALLE",{"$nulls":6},"EXISTENCIAS",null,null,"RESPONSABLE"]
[{"$nulls":3},"CANT.","P.U.","P.T.","CANT.","P.U.","P.T.","CANT.","P.U.","P.T."]

{"sheet":"M22","index":23,"n_rows":9,"n_cols":13,"rows_kept":9,"merged":[[0,0,0,12],[2,0,2,12],[5,6,5,7],[7,0,8,0],[7,1,8,1],[7,2,8,2],[7,3,7,5],[7,6,7,8],[7,9,7,11],[7,12,8,12]]}
["RESTAURANTE CAMINOS DE HERRADURA"]
[]
["KARDEX"]
[]
["Artículo:",{"$f":"'MATERIA PRIMA Y MATERIALES'!E31","v":"#'M22'!A1"},null,null,"Unidad de medida:",null,"LIBRAS",null,"Codigo:",{"$f":"'MATERIA PRIMA Y MATERIALES'!D31","v":"1.1.04.22"}]
["Método:","PROMEDIO PONDERADO",null,null,"Fecha de Corte:",null,{"$f":"NOW()","v":"2010-06-10T17:02:54.760"}]
[]
["FECHA","ORDEN DE \nPRODUCCIÓN","DETALLE",{"$nulls":6},"EXISTENCIAS",null,null,"RESPONSABLE"]
[{"$nulls":3},"CANT.","P.U.","P.T.","CANT.","P.U.","P.T.","CANT.","P.U.","P.T."]

{"sheet":"M23","index":24,"n_rows":9,"n_cols":13,"rows_kept":9,"merged":[[0,0,0,12],[2,0,2,12],[5,6,5,7],[7,0,8,0],[7,1,8,1],[7,2,8,2],[7,3,7,5],[7,6,7,8],[7,9,7,11],[7,12,8,12]]}
["RESTAURANTE CAMINOS DE HERRADURA"]
[]
["KARDEX"]
[]
["Artículo:",{"$f":"'MATERIA PRIMA Y MATERIALES'!E32","v":"#'M23'!A1"},null,null,"Unidad de medida:",null,"LIBRAS",null,"Codigo:",{"$f":"'MATERIA PRIMA Y MATERIALES'!D32","v":"1.1.04.23"}]
["Método:","PROMEDIO PONDERADO",null,null,"Fecha de Corte:",null,{"$f":"NOW()","v":"2010-06-10T17:02:54.760"}]
[]
["FECHA","ORDEN DE \nPRODUCCIÓN","DETALLE",{"$nulls":6},"EXISTENCIAS",null,null,"RESPONSABLE"]
[{"$nulls":3},"CANT.","P.U.","P.T.","CANT.","P.U.","P.T.","CANT.","P.U.","P.T."]

{"sheet":"M24","index":25,"n_rows":9,"n_cols":13,"rows_kept":9,"merged":[[0,0,0,12],[2,0,2,12],[5,6,5,7],[7,0,8,0],[7,1,8,1],[7,2,8,2],[7,3,7,5],[7,6,7,8],[7,9,7,11],[7,12,8,12]]}
["RESTAURANTE CAMINOS DE HERRADURA"]
[]
["KARDEX"]
[]
["Artículo:",{"$f":"'MATERIA PRIMA Y MATERIALES'!E33","v":"#'M24'!A1"},null,null,"Unidad de medida:",null,"LIBRAS",null,"Codigo:",{"$f":"'MATERIA PRIMA Y MATERIALES'!D33","v":"1.1.04.24"}]
["Método:","PROMEDIO PONDERADO",null,null,"Fecha de Corte:",null,{"$f":"NOW()","v":"2010-06-10T17:02:54.760"}]
[]
["FECHA","ORDEN DE \nPRODUCCIÓN","DETALLE",{"$nulls":6},"EXISTENCIAS",null,null,"RESPONSABLE"]
[{"$nulls":3},"CANT.","P.U.","P.T.","CANT.","P.U.","P.T.","CANT.","P.U.","P.T."]

{"sheet":"M25","index":26,"n_rows":9,"n_cols":13,"rows_kept":9,"merged":[[0,0,0,12],[2,0,2,12],[5,6,5,7],[7,0,8,0],[7,1,8,1],[7,2,8,2],[7,3,7,5],[7,6,7,8],[7,9,7,11],[7,12,8,12]]}
["RESTAURANTE CAMINOS DE HERRADURA"]
[]
["KARDEX"]
[]
["Artículo:",{"$f":"'MATERIA PRIMA Y MATERIALES'!E34","v":"#'M25'!A1"},null,null,"Unidad de medida:",null,"LIBRAS",null,"Codigo:",{"$f":"'MATERIA PRIMA Y MATERIALES'!D34","v":"1.1.04.25"}]
["Método:","PROMEDIO PONDERADO",null,null,"Fecha de Corte:",null,{"$f":"NOW()","v":"2010-06-10T17:02:54.760"}]
[]
["FECHA","ORDEN DE \nPRODUCCIÓN","DETALLE",{"$nulls":6},"EXISTENCIAS",null,null,"RESPONSABLE"]
[{"$nulls":3},"CANT.","P.U.","P.T.","CANT.","P.U.","P.T.","CANT.","P.U.","P.T."]

{"sheet":"M26","index":27,"n_rows":9,"n_cols":13,"rows_kept":9,"merged":[[0,0,0,12],[2,0,2,12],[5,6,5,7],[7,0,8,0],[7,1,8,1],[7,2,8,2],[7,3,7,5],[7,6,7,8],[7,9,7,11],[7,12,8,12]]}
["RESTAURANTE CAMINOS DE HERRADURA"]
[]
["KARDEX"]
[]
["Artículo:",{"$f":"'MATERIA PRIMA Y MATERIALES'!E35","v":"#'M26'!A1"},null,null,"Unidad de medida:",null,"LIBRAS",null,"Codigo:",{"$f":"'MATERIA PRIMA Y MATERIALES'!D35","v":"1.1.04.26"}]
["Método:","PROMEDIO PONDERADO",null,null,"Fecha de Corte:",null,{"$f":"NOW()","v":"2010-06-10T17:02:54.760"}]
[]
["FECHA","ORDEN DE \nPRODUCCIÓN","DETALLE",{"$nulls":6},"EXISTENCIAS",null,null,"RESPONSABLE"]
[{"$nulls":3},"CANT.","P.U.","P.T.","CANT.","P.U.","P.T.","CANT.","P.U.","P.T."]

{"sheet":"M27","index":28,"n_rows":9,"n_cols":13,"rows_kept":9,"merged":[[0,0,0,12],[2,0,2,12],[5,6,5,7],[7,0,8,0],[7,1,8,1],[7,2,8,2],[7,3,7,5],[7,6,7,8],[7,9,7,11],[7,12,8,12]]}
["RESTAURANTE CAMINOS DE HERRADURA"]
[]
["KARDEX"]
[]
["Artículo:",{"$f":"'MATERIA PRIMA Y MATERIALES'!E36","v":"#'M27'!A1"},null,null,"Unidad de medida:",null,"LIBRAS",null,"Codigo:",{"$f":"'MATERIA PRIMA Y MATERIALES'!D36","v":"1.1.04.27"}]
["Método:","PROMEDIO PONDERADO",null,null,"Fecha de Corte:",null,{"$f":"NOW()","v":"2010-06-10T17:02:54.760"}]
[]
["FECHA","ORDEN DE \nPRODUCCIÓN","DETALLE",{"$nulls":6},"EXISTENCIAS",null,null,"RESPONSABLE"]
[{"$nulls":3},"CANT.","P.U.","P.T.","CANT.","P.U.","P.T.","CANT.","P.U.","P.T."]

{"sheet":"M28","index":29,"n_rows":9,"n_cols":13,"rows_kept":9,"merged":[[0,0,0,12],[2,0,2,12],[5,6,5,7],[7,0,8,0],[7,1,8,1],[7,2,8,2],[7,3,7,5],[7,6,7,8],[7,9,7,11],[7,12,8,12]]}
["RESTAURANTE CAMINOS DE HERRADURA"]
[]
["KARDEX"]
[]
["Artículo:",{"$f":"'MATERIA PRIMA Y MATERIALES'!E37","v":"#'M28'!A1"},null,null,"Unidad de medida:",null,"LIBRAS",null,"Codigo:",{"$f":"'MATERIA PRIMA Y MATERIALES'!D37","v":"1.1.04.28"}]
["Método:","PROMEDIO PONDERADO",null,null,"Fecha de Corte:",null,{"$f":"NOW()","v":"2010-06-10T17:02:54.760"}]
[]
["FECHA","ORDEN DE \nPRODUCCIÓN","DETALLE",{"$nulls":6},"EXISTENCIAS",null,null,"RESPONSABLE"]
[{"$nulls":3},"CANT.","P.U.","P.T.","CANT.","P.U.","P.T.","CANT.","P.U.","P.T."]

{"sheet":"M29","index":30,"n_rows":9,"n_cols":13,"rows_kept":9,"merged":[[0,0,0,12],[2,0,2,12],[5,6,5,7],[7,0,8,0],[7,1,8,1],[7,2,8,2],[7,3,7,5],[7,6,7,8],[7,9,7,11],[7,12,8,12]]}
["RESTAURANTE CAMINOS DE HERRADURA"]
[]
["KARDEX"]
[]
["Artículo:",{"$f":"'MATERIA PRIMA Y MATERIALES'!E38","v":"#'M29'!A1"},null,null,"Unidad de medida:",null,"LIBRAS",null,"Codigo:",{"$f":"'MATERIA PRIMA Y MATERIALES'!D38","v":"1.1.04.29"}]
["Método:","PROMEDIO PONDERADO",null,null,"Fecha de Corte:",null,{"$f":"NOW()","v":"2010-06-10T17:02:54.760"}]
[]
["FECHA","ORDEN DE \nPRODUCCIÓN","DETALLE",{"$nulls":6},"EXISTENCIAS",null,null,"RESPONSABLE"]
[{"$nulls":3},"CANT.","P.U.","P.T.","CANT.","P.U.","P.T.","CANT.","P.U.","P.T."]

{"sheet":"M30","index":31,"n_rows":9,"n_cols":13,"rows_kept":9,"merged":[[0,0,0,12],[2,0,2,12],[5,6,5,7],[7,0,8,0],[7,1,8,1],[7,2,8,2],[7,3,7,5],[7,6,7,8],[7,9,7,11],[7,12,8,12]]}
["RESTAURANTE CAMINOS DE HERRADURA"]
[]
["KARDEX"]
[]
["Artículo:",{"$f":"'MATERIA PRIMA Y MATERIALES'!E39","v":"#'M30'!A1"},null,null,"Unidad de medida:",null,"LIBRAS",null,"Codigo:",{"$f":"'MATERIA PRIMA Y MATERIALES'!D39","v":"1.1.04.30"}]
["Método:","PROMEDIO PONDERADO",null,null,"Fecha de Corte:",null,{"$f":"NOW()","v":"2010-06-10T17:02:54.760"}]
[]
["FECHA","ORDEN DE \nPRODUCCIÓN","DETALLE",{"$nulls":6},"EXISTENCIAS",null,null,"RESPONSABLE"]
[{"$nulls":3},"CANT.","P.U.","P.T.","CANT.","P.U.","P.T.","CANT.","P.U.","P.T."]

{"sheet":"M31","index":32,"n_rows":9,"n_cols":13,"rows_kept":9,"merged":[[0,0,0,12],[2,0,2,12],[5,6,5,7],[7,0,8,0],[7,1,8,1],[7,2,8,2],[7,3,7,5],[7,6,7,8],[7,9,7,11],[7,12,8,12]]}
["RESTAURANTE CAMINOS DE HERRADURA"]
[]
["KARDEX"]
[]
["Artículo:",{"$f":"'MATERIA PRIMA Y MATERIALES'!E40","v":"#'M31'!A1"},null,null,"Unidad de medida:",null,"LIBRAS",null,"Codigo:",{"$f":"'MATERIA PRIMA Y MATERIALES'!D40","v":"1.1.04.31"}]
["Método:","PROMEDIO PONDERADO",null,null,"Fecha de Corte:",null,{"$f":"NOW()","v":"2010-06-10T17:02:54.760"}]
[]
["FECHA","ORDEN DE \nPRODUCCIÓN","DETALLE",{"$nulls":6},"EXISTENCIAS",null,null,"RESPONSABLE"]
[{"$nulls":3},"CANT.","P.U.","P.T.","CANT.","P.U.","P.T.","CANT.","P.U.","P.T."]

{"sheet":"M32","index":33,"n_rows":9,"n_cols":13,"rows_kept":9,"merged":[[0,0,0,12],[2,0,2,12],[5,6,5,7],[7,0,8,0],[7,1,8,1],[7,2,8,2],[7,3,7,5],[7,6,7,8],[7,9,7,11],[7,12,8,12]]}
["RESTAURANTE CAMINOS DE HERRADURA"]
[]
["KARDEX"]
[]
["Artículo:",{"$f":"'MATERIA PRIMA Y MATERIALES'!E41","v":"#'M32'!A1"},null,null,"Unidad de medida:",null,"LIBRAS",null,"Codigo:",{"$f":"'MATERIA PRIMA Y MATERIALES'!D41","v":"1.1.04.32"}]
["Método:","PROMEDIO PONDERADO",null,null,"Fecha de Corte:",null,{"$f":"NOW()","v":"2010-06-10T17:02:54.760"}]
[]
["FECHA","ORDEN DE \nPRODUCCIÓN","DETALLE",{"$nulls":6},"EXISTENCIAS",null,null,"RESPONSABLE"]
[{"$nulls":3},"CANT.","P.U.","P.T.","CANT.","P.U.","P.T.","CANT.","P.U.","P.T."]

{"sheet":"M33","index":34,"n_rows":9,"n_cols":13,"rows_kept":9,"merged":[[0,0,0,12],[2,0,2,12],[5,6,5,7],[7,0,8,0],[7,1,8,1],[7,2,8,2],[7,3,7,5],[7,6,7,8],[7,9,7,11],[7,12,8,12]]}
["RESTAURANTE CAMINOS DE HERRADURA"]
[]
["KARDEX"]
[]
["Artículo:",{"$f":"'MATERIA PRIMA Y MATERIALES'!E42","v":"#'M33'!A1"},null,null,"Unidad de medida:",null,"LIBRAS",null,"Codigo:",{"$f":"'MATERIA PRIMA Y MATERIALES'!D42","v":"1.1.04.33"}]
["Método:","PROMEDIO PONDERADO",null,null,"Fecha de Corte:",null,{"$f":"NOW()","v":"2010-06-10T17:02:54.760"}]
[]
["FECHA","ORDEN DE \nPRODUCCIÓN","DETALLE",{"$nulls":6},"EXISTENCIAS",null,null,"RESPONSABLE"]
[{"$nulls":3},"CANT.","P.U.","P.T.","CANT.","P.U.","P.T.","CANT.","P.U.","P.T."]

{"sheet":"M34","index":35,"n_rows":9,"n_cols":13,"rows_kept":9,"merged":[[0,0,0,12],[2,0,2,12],[5,6,5,7],[7,0,8,0],[7,1,8,1],[7,2,8,2],[7,3,7,5],[7,6,7,8],[7,9,7,11],[7,12,8,12]]}
["RESTAURANTE CAMINOS DE HERRADURA"]
[]
["KARDEX"]
[]
["Artículo:",{"$f":"'MATERIA PRIMA Y MATERIALES'!E43","v":"#'M34'!A1"},null,null,"Unidad de medida:",null,"LIBRAS",null,"Codigo:",{"$f":"'MATERIA PRIMA Y MATERIALES'!D43","v":"1.1.04.34"}]
["Método:","PROMEDIO PONDERADO",null,null,"Fecha de Corte:",null,{"$f":"NOW()","v":"2010-06-10T17:02:54.760"}]
[]
["FECHA","ORDEN DE \nPRODUCCIÓN","DETALLE",{"$nulls":6},"EXISTENCIAS",null,null,"RESPONSABLE"]
[{"$nulls":3},"CANT.","P.U.","P.T.","CANT.","P.U.","P.T.","CANT.","P.U.","P.T."]

{"sheet":"M35","index":36,"n_rows":9,"n_cols":13,"rows_kept":9,"merged":[[0,0,0,12],[2,0,2,12],[5,6,5,7],[7,0,8,0],[7,1,8,1],[7,2,8,2],[7,3,7,5],[7,6,7,8],[7,9,7,11],[7,12,8,12]]}
["RESTAURANTE CAMINOS DE HERRADURA"]
[]
["KARDEX"]
[]
["Artículo:",{"$f":"'MATERIA PRIMA Y MATERIALES'!E44","v":"#'M35'!A1"},null,null,"Unidad de medida:",null,"LIBRAS",null,"Codigo:",{"$f":"'MATERIA PRIMA Y MATERIALES'!D44","v":"1.1.04.35"}]
["Método:","PROMEDIO PONDERADO",null,null,"Fecha de Corte:",null,{"$f":"NOW()","v":"2010-06-10T17:02:54.760"}]
[]
["FECHA","ORDEN DE \nPRODUCCIÓN","DETALLE",{"$nulls":6},"EXISTENCIAS",null,null,"RESPONSABLE"]
[{"$nulls":3},"CANT.","P.U.","P.T.","CANT.","P.U.","P.T.","CANT.","P.U.","P.T."]

{"sheet":"M36","index":37,"n_rows":9,"n_cols":13,"rows_kept":9,"merged":[[0,0,0,12],[2,0,2,12],[5,6,5,7],[7,0,8,0],[7,1,8,1],[7,2,8,2],[7,3,7,5],[7,6,7,8],[7,9,7,11],[7,12,8,12]]}
["RESTAURANTE CAMINOS DE HERRADURA"]
[]
["KARDEX"]
[]
["Artículo:",{"$f":"'MATERIA PRIMA Y MATERIALES'!E45","v":"#'M36'!A1"},null,null,"Unidad de medida:",null,"LIBRAS",null,"Codigo:",{"$f":"'MATERIA PRIMA Y MATERIALES'!D45","v":"1.1.04.36"}]
["Método:","PROMEDIO PONDERADO",null,null,"Fecha de Corte:",null,{"$f":"NOW()","v":"2010-06-10T17:02:54.760"}]
[]
["FECHA","ORDEN DE \nPRODUCCIÓN","DETALLE",{"$nulls":6},"EXISTENCIAS",null,null,"RESPONSABLE"]
[{"$nulls":3},"CANT.","P.U.","P.T.","CANT.","P.U.","P.T.","CANT.","P.U.","P.T."]

{"sheet":"M37","index":38,"n_rows":9,"n_cols":13,"rows_kept":9,"merged":[[0,0,0,12],[2,0,2,12],[5,6,5,7],[7,0,8,0],[7,1,8,1],[7,2,8,2],[7,3,7,5],[7,6,7,8],[7,9,7,11],[7,12,8,12]]}
["RESTAURANTE CAMINOS DE HERRADURA"]
[]
["KARDEX"]
[]
["Artículo:",{"$f":"'MATERIA PRIMA Y MATERIALES'!E46","v":"#'M37'!A1"},null,null,"Unidad de medida:",null,"LIBRAS",null,"Codigo:",{"$f":"'MATERIA PRIMA Y MATERIALES'!D46","v":"1.1.04.37"}]
["Método:","PROMEDIO PONDERADO",null,null,"Fecha de Corte:",null,{"$f":"NOW()","v":"2010-06-10T17:02:54.760"}]
[]
["FECHA","ORDEN DE \nPRODUCCIÓN","DETALLE",{"$nulls":6},"EXISTENCIAS",null,null,"RESPONSABLE"]
[{"$nulls":3},"CANT.","P.U.","P.T.","CANT.","P.U.","P.T.","CANT.","P.U.","P.T."]

{"sheet":"M38","index":39,"n_rows":9,"n_cols":13,"rows_kept":9,"merged":[[0,0,0,12],[2,0,2,12],[5,6,5,7],[7,0,8,0],[7,1,8,1],[7,2,8,2],[7,3,7,5],[7,6,7,8],[7,9,7,11],[7,12,8,12]]}
["RESTAURANTE CAMINOS DE HERRADURA"]
[]
["KARDEX"]
[]
["Artículo:",{"$f":"'MATERIA PRIMA Y MATERIALES'!E47","v":"#'M38'!A1"},null,null,"Unidad de medida:",null,"LIBRAS",null,"Codigo:",{"$f":"'MATERIA PRIMA Y MATERIALES'!D47","v":"1.1.04.38"}]
["Método:","PROMEDIO PONDERADO",null,null,"Fecha de Corte:",null,{"$f":"NOW()","v":"2010-06-10T17:02:54.760"}]
[]
["FECHA","ORDEN DE \nPRODUCCIÓN","DETALLE",{"$nulls":6},"EXISTENCIAS",null,null,"RESPONSABLE"]
[{"$nulls":3},"CANT.","P.U.","P.T.","CANT.","P.U.","P.T.","CANT.","P.U.","P.T."]

{"sheet":"M39","index":40,"n_rows":9,"n_cols":13,"rows_kept":9,"merged":[[0,0,0,12],[2,0,2,12],[5,6,5,7],[7,0,8,0],[7,1,8,1],[7,2,8,2],[7,3,7,5],[7,6,7,8],[7,9,7,11],[7,12,8,12]]}
["RESTAURANTE CAMINOS DE HERRADURA"]
[]
["KARDEX"]
[]
["Artículo:",{"$f":"'MATERIA PRIMA Y MATERIALES'!E48","v":"#'M39'!A1"},null,null,"Unidad de medida:",null,"LIBRAS",null,"Codigo:",{"$f":"'MATERIA PRIMA Y MATERIALES'!D48","v":"1.1.04.39"}]
["Método:","PROMEDIO PONDERADO",null,null,"Fecha de Corte:",null,{"$f":"NOW()","v":"2010-06-10T17:02:54.760"}]
[]
["FECHA","ORDEN DE \nPRODUCCIÓN","DETALLE",{"$nulls":6},"EXISTENCIAS",null,null,"RESPONSABLE"]
[{"$nulls":3},"CANT.","P.U.","P.T.","CANT.","P.U.","P.T.","CANT.","P.U.","P.T."]

{"sheet":"M40","index":41,"n_rows":9,"n_cols":13,"rows_kept":9,"merged":[[0,0,0,12],[2,0,2,12],[5,6,5,7],[7,0,8,0],[7,1,8,1],[7,2,8,2],[7,3,7,5],[7,6,7,8],[7,9,7,11],[7,12,8,12]]}
["RESTAURANTE CAMINOS DE HERRADURA"]
[]
["KARDEX"]
[]
["Artículo:",{"$f":"'MATERIA PRIMA Y MATERIALES'!E49","v":"#'M40'!A1"},null,null,"Unidad de medida:",null,"LIBRAS",null,"Codigo:",{"$f":"'MATERIA PRIMA Y MATERIALES'!D49","v":"1.1.04.40"}]
["Método:","PROMEDIO PONDERADO",null,null,"Fecha de Corte:",null,{"$f":"NOW()","v":"2010-06-10T17:02:54.760"}]
[]
["FECHA","ORDEN DE \nPRODUCCIÓN","DETALLE",{"$nulls":6},"EXISTENCIAS",null,null,"RESPONSABLE"]
[{"$nulls":3},"CANT.","P.U.","P.T.","CANT.","P.U.","P.T.","CANT.","P.U.","P.T."]

{"sheet":"M41","index":42,"n_rows":9,"n_cols":13,"rows_kept":9,"merged":[[0,0,0,12],[2,0,2,12],[5,6,5,7],[7,0,8,0],[7,1,8,1],[7,2,8,2],[7,3,7,5],[7,6,7,8],[7,9,7,11],[7,12,8,12]]}
["RESTAURANTE CAMINOS DE HERRADURA"]
[]
["KARDEX"]
[]
["Artículo:",{"$f":"'MATERIA PRIMA Y MATERIALES'!E50","v":"#'M41'!A1"},null,null,"Unidad de medida:",null,"LIBRAS",null,"Codigo:",{"$f":"'MATERIA PRIMA Y MATERIALES'!D50","v":"1.1.04.41"}]
["Método:","PROMEDIO PONDERADO",null,null,"Fecha de Corte:",null,{"$f":"NOW()","v":"2010-06-10T17:02:54.760"}]
[]
["FECHA","ORDEN DE \nPRODUCCIÓN","DETALLE",{"$nulls":6},"EXISTENCIAS",null,null,"RESPONSABLE"]
[{"$nulls":3},"CANT.","P.U.","P.T.","CANT.","P.U.","P.T.","CANT.","P.U.","P.T."]

{"sheet":"M42","index":43,"n_rows":9,"n_cols":13,"rows_kept":9,"merged":[[0,0,0,12],[2,0,2,12],[5,6,5,7],[7,0,8,0],[7,1,8,1],[7,2,8,2],[7,3,7,5],[7,6,7,8],[7,9,7,11],[7,12,8,12]]}
["RESTAURANTE CAMINOS DE HERRADURA"]
[]
["KARDEX"]
[]
["Artículo:",{"$f":"'MATERIA PRIMA Y MATERIALES'!E51","v":"#'M42'!A1"},null,null,"Unidad de medida:",null,"LIBRAS",null,"Codigo:",{"$f":"'MATERIA PRIMA Y MATERIALES'!D51","v":"1.1.04.42"}]
["Método:","PROMEDIO PONDERADO",null,null,"Fecha de Corte:",null,{"$f":"NOW()","v":"2010-06-10T17:02:54.760"}]
[]
["FECHA","ORDEN DE \nPRODUCCIÓN","DETALLE",{"$nulls":6},"EXISTENCIAS",null,null,"RESPONSABLE"]
[{"$nulls":3},"CANT.","P.U.","P.T.","CANT.","P.U.","P.T.","CANT.","P.U.","P.T."]

{"sheet":"M43","index":44,"n_rows":9,"n_cols":13,"rows_kept":9,"merged":[[0,0,0,12],[2,0,2,12],[5,6,5,7],[7,0,8,0],[7,1,8,1],[7,2,8,2],[7,3,7,5],[7,6,7,8],[7,9,7,11],[7,12,8,12]]}
["RESTAURANTE CAMINOS DE HERRADURA"]
[]
["KARDEX"]
[]
["Artículo:",{"$f":"'MATERIA PRIMA Y MATERIALES'!E52","v":"#'M43'!A1"},null,null,"Unidad de medida:",null,"LIBRAS",null,"Codigo:",{"$f":"'MATERIA PRIMA Y MATERIALES'!D52","v":"1.1.04.43"}]
["Método:","PROMEDIO PONDERADO",null,null,"Fecha de Corte:",null,{"$f":"NOW()","v":"2010-06-10T17:02:54.760"}]
[]
["FECHA","ORDEN DE \nPRODUCCIÓN","DETALLE",{"$nulls":6},"EXISTENCIAS",null,null,"RESPONSABLE"]
[{"$nulls":3},"CANT.","P.U.","P.T.","CANT.","P.U.","P.T.","CANT.","P.U.","P.T."]

{"sheet":"M44","index":45,"n_rows":9,"n_cols":13,"rows_kept":9,"merged":[[0,0,0,12],[2,0,2,12],[5,6,5,7],[7,0,8,0],[7,1,8,1],[7,2,8,2],[7,3,7,5],[7,6,7,8],[7,9,7,11],[7,12,8,12]]}
["RESTAURANTE CAMINOS DE HERRADURA"]
[]
["KARDEX"]
[]
["Artículo:",{"$f":"'MATERIA PRIMA Y MATERIALES'!E53","v":"#'M44'!A1"},null,null,"Unidad de medida:",null,"LIBRAS",null,"Codigo:",{"$f":"'MATERIA PRIMA Y MATERIALES'!D53","v":"1.1.04.44"}]
["Método:","PROMEDIO PONDERADO",null,null,"Fecha de Corte:",null,{"$f":"NOW()","v":"2010-06-10T17:02:54.760"}]
[]
["FECHA","ORDEN DE \nPRODUCCIÓN","DETALLE",{"$nulls":6},"EXISTENCIAS",null,null,"RESPONSABLE"]
[{"$nulls":3},"CANT.","P.U.","P.T.","CANT.","P.U.","P.T.","CANT.","P.U.","P.T."]

{"sheet":"M45","index":46,"n_rows":9,"n_cols":13,"rows_kept":9,"merged":[[0,0,0,12],[2,0,2,12],[5,6,5,7],[7,0,8,0],[7,1,8,1],[7,2,8,2],[7,3,7,5],[7,6,7,8],[7,9,7,11],[7,12,8,12]]}
["RESTAURANTE CAMINOS DE HERRADURA"]
[]
["KARDEX"]
[]
["Artículo:",{"$f":"'MATERIA PRIMA Y MATERIALES'!E54","v":"#'M45'!A1"},null,null,"Unidad de medida:",null,"LIBRAS",null,"Codigo:",{"$f":"'MATERIA PRIMA Y MATERIALES'!D54","v":"1.1.04.45"}]
["Método:","PROMEDIO PONDERADO",null,null,"Fecha de Corte:",null,{"$f":"NOW()","v":"2010-06-10T17:02:54.760"}]
[]
["FECHA","ORDEN DE \nPRODUCCIÓN","DETALLE",{"$nulls":6},"EXISTENCIAS",null,null,"RESPONSABLE"]
[{"$nulls":3},"CANT.","P.U.","P.T.","CANT.","P.U.","P.T.","CANT.","P.U.","P.T."]

{"sheet":"M46","index":47,"n_rows":9,"n_cols":13,"rows_kept":9,"merged":[[0,0,0,12],[2,0,2,12],[5,6,5,7],[7,0,8,0],[7,1,8,1],[7,2,8,2],[7,3,7,5],[7,6,7,8],[7,9,7,11],[7,12,8,12]]}
["RESTAURANTE CAMINOS DE HERRADURA"]
[]
["KARDEX"]
[]
["Artículo:",{"$f":"'MATERIA PRIMA Y MATERIALES'!E55","v":"#'M46'!A1"},null,null,"Unidad de medida:",null,"LIBRAS",null,"Codigo:",{"$f":"'MATERIA PRIMA Y MATERIALES'!D55","v":"1.1.04.46"}]
["Método:","PROMEDIO PONDERADO",null,null,"Fecha de Corte:",null,{"$f":"NOW()","v":"2010-06-10T17:02:54.760"}]
[]
["FECHA","ORDEN DE \nPRODUCCIÓN","DETALLE",{"$nulls":6},"EXISTENCIAS",null,null,"RESPONSABLE"]
[{"$nulls":3},"CANT.","P.U.","P.T.","CANT.","P.U.","P.T.","CANT.","P.U.","P.T."]

{"sheet":"M47","index":48,"n_rows":9,"n_cols":13,"rows_kept":9,"merged":[[0,0,0,12],[2,0,2,12],[5,6,5,7],[7,0,8,0],[7,1,8,1],[7,2,8,2],[7,3,7,5],[7,6,7,8],[7,9,7,11],[7,12,8,12]]}
["RESTAURANTE CAMINOS DE HERRADURA"]
[]
["KARDEX"]
[]
["Artículo:",{"$f":"'MATERIA PRIMA Y MATERIALES'!E56","v":"#'M47'!A1"},null,null,"Unidad de medida:",null,"LIBRAS",null,"Codigo:",{"$f":"'MATERIA PRIMA Y MATERIALES'!D56","v":"1.1.04.47"}]
["Método:","PROMEDIO PONDERADO",null,null,"Fecha de Corte:",null,{"$f":"NOW()","v":"2010-06-10T17:02:54.760"}]
[]
["FECHA","ORDEN DE \nPRODUCCIÓN","DETALLE",{"$nulls":6},"EXISTENCIAS",null,null,"RESPONSABLE"]
[{"$nulls":3},"CANT.","P.U.","P.T.","CANT.","P.U.","P.T.","CANT.","P.U.","P.T."]

{"sheet":"M48","index":49,"n_rows":9,"n_cols":13,"rows_kept":9,"merged":[[0,0,0,12],[2,0,2,12],[5,6,5,7],[7,0,8,0],[7,1,8,1],[7,2,8,2],[7,3,7,5],[7,6,7,8],[7,9,7,11],[7,12,8,12]]}
["RESTAURANTE CAMINOS DE HERRADURA"]
[]
["KARDEX"]
[]
["Artículo:",{"$f":"'MATERIA PRIMA Y MATERIALES'!E57","v":"#'M48'!A1"},null,null,"Unidad de medida:",null,"LIBRAS",null,"Codigo:",{"$f":"'MATERIA PRIMA Y MATERIALES'!D57","v":"1.1.04.48"}]
["Método:","PROMEDIO PONDERADO",null,null,"Fecha de Corte:",null,{"$f":"NOW()","v":"2010-06-10T17:02:54.760"}]
[]
["FECHA","ORDEN DE \nPRODUCCIÓN","DETALLE",{"$nulls":6},"EXISTENCIAS",null,null,"RESPONSABLE"]
[{"$nulls":3},"CANT.","P.U.","P.T.","CANT.","P.U.","P.T.","CANT.","P.U.","P.T."]

{"sheet":"M49","index":50,"n_rows":9,"n_cols":13,"rows_kept":9,"merged":[[0,0,0,12],[2,0,2,12],[5,6,5,7],[7,0,8,0],[7,1,8,1],[7,2,8,2],[7,3,7,5],[7,6,7,8],[7,9,7,11],[7,12,8,12]]}
["RESTAURANTE CAMINOS DE HERRADURA"]
[]
["KARDEX"]
[]
["Artículo:",{"$f":"'MATERIA PRIMA Y MATERIALES'!E58","v":"#'M49'!A1"},null,null,"Unidad de medida:",null,"LIBRAS",null,"Codigo:",{"$f":"'MATERIA PRIMA Y MATERIALES'!D58","v":"1.1.04.49"}]
["Método:","PROMEDIO PONDERADO",null,null,"Fecha de Corte:",null,{"$f":"NOW()","v":"2010-06-10T17:02:54.760"}]
[]
["FECHA","ORDEN DE \nPRODUCCIÓN","DETALLE",{"$nulls":6},"EXISTENCIAS",null,null,"RESPONSABLE"]
[{"$nulls":3},"CANT.","P.U.","P.T.","CANT.","P.U.","P.T.","CANT.","P.U.","P.T."]

{"sheet":"M50","index":51,"n_rows":9,"n_cols":13,"rows_kept":9,"merged":[[0,0,0,12],[2,0,2,12],[5,6,5,7],[7,0,8,0],[7,1,8,1],[7,2,8,2],[7,3,7,5],[7,6,7,8],[7,9,7,11],[7,12,8,12]]}
["RESTAURANTE CAMINOS DE HERRADURA"]
[]
["KARDEX"]
[]
["Artículo:",{"$f":"'MATERIA PRIMA Y MATERIALES'!E59","v":"#'M50'!A1"},null,null,"Unidad de medida:",null,"LIBRAS",null,"Codigo:",{"$f":"'MATERIA PRIMA Y MATERIALES'!D59","v":"1.1.04.50"}]
["Método:","PROMEDIO PONDERADO",null,null,"Fecha de Corte:",null,{"$f":"NOW()","v":"2010-06-10T17:02:54.760"}]
[]
["FECHA","ORDEN DE \nPRODUCCIÓN","DETALLE",{"$nulls":6},"EXISTENCIAS",null,null,"RESPONSABLE"]
[{"$nulls":3},"CANT.","P.U.","P.T.","CANT.","P.U.","P.T.","CANT.","P.U.","P.T."]

{"sheet":"M51","index":52,"n_rows":9,"n_cols":13,"rows_kept":9,"merged":[[0,0,0,12],[2,0,2,12],[5,6,5,7],[7,0,8,0],[7,1,8,1],[7,2,8,2],[7,3,7,5],[7,6,7,8],[7,9,7,11],[7,12,8,12]]}
["RESTAURANTE CAMINOS DE HERRADURA"]
[]
["KARDEX"]
[]
["Artículo:",{"$f":"'MATERIA PRIMA Y MATERIALES'!E60","v":"#'M51'!A1"},"CODIGO ",null,"Unidad de medida:",null,"LIBRAS",null,"Codigo:",{"$f":"'MATERIA PRIMA Y MATERIALES'!D60","v":"1.1.04.51"}]
["Método:","PROMEDIO PONDERADO",null,null,"Fecha de Corte:",null,{"$f":"NOW()","v":"2010-06-10T17:02:54.760"}]
[]
["FECHA","ORDEN DE \nPRODUCCIÓN","DETALLE",{"$nulls":6},"EXISTENCIAS",null,null,"RESPONSABLE"]
[{"$nulls":3},"CANT.","P.U.","P.T.","CANT.","P.U.","P.T.","CANT.","P.U.","P.T."]

{"sheet":"M52","index":53,"n_rows":9,"n_cols":13,"rows_kept":9,"merged":[[0,0,0,12],[2,0,2,12],[5,6,5,7],[7,0,8,0],[7,1,8,1],[7,2,8,2],[7,3,7,5],[7,6,7,8],[7,9,7,11],[7,12,8,12]]}
["RESTAURANTE CAMINOS DE HERRADURA"]
[]
["KARDEX"]
[]
["Artículo:",{"$f":"'MATERIA PRIMA Y MATERIALES'!E61","v":"#'M52'!A1"},null,null,"Unidad de medida:",null,"LIBRAS",null,"Codigo:",{"$f":"'MATERIA PRIMA Y MATERIALES'!D61","v":"1.1.04.52"}]
["Método:","PROMEDIO PONDERADO",null,null,"Fecha de Corte:",null,{"$f":"NOW()","v":"2010-06-10T17:02:54.760"}]
[]
["FECHA","ORDEN DE \nPRODUCCIÓN","DETALLE",{"$nulls":6},"EXISTENCIAS",null,null,"RESPONSABLE"]
[{"$nulls":3},"CANT.","P.U.","P.T.","CANT.","P.U.","P.T.","CANT.","P.U.","P.T."]

{"sheet":"M53","index":54,"n_rows":9,"n_cols":13,"rows_kept":9,"merged":[[0,0,0,12],[2,0,2,12],[5,6,5,7],[7,0,8,0],[7,1,8,1],[7,2,8,2],[7,3,7,5],[7,6,7,8],[7,9,7,11],[7,12,8,12]]}
["RESTAURANTE CAMINOS DE HERRADURA"]
[]
["KARDEX"]
[]
["Artículo:",{"$f":"'MATERIA PRIMA Y MATERIALES'!E62","v":"#'M53'!A1"},null,null,"Unidad de medida:",null,"LIBRAS",null,null,{"$f":"'MATERIA PRIMA Y MATERIALES'!D62","v":"1.1.04.53"}]
["Método:","PROMEDIO PONDERADO",null,null,"Fecha de Corte:",null,{"$f":"NOW()","v":"2010-06-10T17:02:54.760"}]
[]
["FECHA","ORDEN DE \nPRODUCCIÓN","DETALLE",{"$nulls":6},"EXISTENCIAS",null,null,"RESPONSABLE"]
[{"$nulls":3},"CANT.","P.U.","P.T.","CANT.","P.U.","P.T.","CANT.","P.U.","P.T."]

{"sheet":"S1","index":55,"n_rows":9,"n_cols":13,"rows_kept":9,"merged":[[0,0,0,12],[2,0,2,12],[5,6,5,7],[7,0,8,0],[7,1,8,1],[7,2,8,2],[7,3,7,5],[7,6,7,8],[7,9,7,11],[7,12,8,12]]}
["RESTAURANTE CAMINOS DE HERRADURA"]
[]
["KARDEX"]
[]
["Artículo:","ACEITE","CODIGO ",null,"Unidad de medida:",null,"LIBRAS"]
["Método:","PROMEDIO PONDERADO",null,null,"Fecha de Corte:",null,{"$f":"NOW()","v":"2010-06-10T17:02:54.760"}]
[]
["FECHA","ORDEN DE \nPRODUCCIÓN","DETALLE",{"$nulls":6},"EXISTENCIAS",null,null,"RESPONSABLE"]
[{"$nulls":3},"CANT.","P.U.","P.T.","CANT.","P.U.","P.T.","CANT.","P.U.","P.T."]

{"sheet":"S2","index":56,"n_rows":9,"n_cols":13,"rows_kept":9,"merged":[[0,0,0,12],[2,0,2,12],[5,6,5,7],[7,0,8,0],[7,1,8,1],[7,2,8,2],[7,3,7,5],[7,6,7,8],[7,9,7,11],[7,12,8,12]]}
["RESTAURANTE CAMINOS DE HERRADURA"]
[]
["KARDEX"]
[]
["Artículo:","ACEITE","CODIGO ",null,"Unidad de medida:",null,"LIBRAS"]
["Método:","PROMEDIO PONDERADO",null,null,"Fecha de Corte:",null,{"$f":"NOW()","v":"2010-06-10T17:02:54.760"}]
[]
["FECHA","ORDEN DE \nPRODUCCIÓN","DETALLE",{"$nulls":6},"EXISTENCIAS",null,null,"RESPONSABLE"]
[{"$nulls":3},"CANT.","P.U.","P.T.","CANT.","P.U.","P.T.","CANT.","P.U.","P.T."]

{"sheet":"S3","index":57,"n_rows":9,"n_cols":13,"rows_kept":9,"merged":[[0,0,0,12],[2,0,2,12],[5,6,5,7],[7,0,8,0],[7,1,8,1],[7,2,8,2],[7,3,7,5],[7,6,7,8],[7,9,7,11],[7,12,8,12]]}
["RESTAURANTE CAMINOS DE HERRADURA"]
[]
["KARDEX"]
[]
["Artículo:","ACEITE","CODIGO ",null,"Unidad de medida:",null,"LIBRAS"]
["Método:","PROMEDIO PONDERADO",null,null,"Fecha de Corte:",null,{"$f":"NOW()","v":"2010-06-10T17:02:54.760"}]
[]
["FECHA","ORDEN DE \nPRODUCCIÓN","DETALLE",{"$nulls":6},"EXISTENCIAS",null,null,"RESPONSABLE"]
[{"$nulls":3},"CANT.","P.U.","P.T.","CANT.","P.U.","P.T.","CANT.","P.U.","P.T."]

{"sheet":"S4","index":58,"n_rows":9,"n_cols":13,"rows_kept":9,"merged":[[0,0,0,12],[2,0,2,12],[5,6,5,7],[7,0,8,0],[7,1,8,1],[7,2,8,2],[7,3,7,5],[7,6,7,8],[7,9,7,11],[7,12,8,12]]}
["RESTAURANTE CAMINOS DE HERRADURA"]
[]
["KARDEX"]
[]
["Artículo:","ACEITE","CODIGO ",null,"Unidad de medida:",null,"LIBRAS"]
["Método:","PROMEDIO PONDERADO",null,null,"Fecha de Corte:",null,{"$f":"NOW()","v":"2010-06-10T17:02:54.760"}]
[]
["FECHA","ORDEN DE \nPRODUCCIÓN","DETALLE",{"$nulls":6},"EXISTENCIAS",null,null,"RESPONSABLE"]
[{"$nulls":3},"CANT.","P.U.","P.T.","CANT.","P.U.","P.T.","CANT.","P.U.","P.T."]

{"sheet":"S5","index":59,"n_rows":9,"n_cols":13,"rows_kept":9,"merged":[[0,0,0,12],[2,0,2,12],[5,6,5,7],[7,0,8,0],[7,1,8,1],[7,2,8,2],[7,3,7,5],[7,6,7,8],[7,9,7,11],[7,12,8,12]]}
["RESTAURANTE CAMINOS DE HERRADURA"]
[]
["KARDEX"]
[]
["Artículo:","ACEITE","CODIGO ",null,"Unidad de medida:",null,"LIBRAS"]
["Método:","PROMEDIO PONDERADO",null,null,"Fecha de Corte:",null,{"$f":"NOW()","v":"2010-06-10T17:02:54.760"}]
[]
["FECHA","ORDEN DE \nPRODUCCIÓN","DETALLE",{"$nulls":6},"EXISTENCIAS",null,null,"RESPONSABLE"]
[{"$nulls":3},"CANT.","P.U.","P.T.","CANT.","P.U.","P.T.","CANT.","P.U.","P.T."]

{"sheet":"S6","index":60,"n_rows":9,"n_cols":13,"rows_kept":9,"merged":[[0,0,0,12],[2,0,2,12],[5,6,5,7],[7,0,8,0],[7,1,8,1],[7,2,8,2],[7,3,7,5],[7,6,7,8],[7,9,7,11],[7,12,8,12]]}
["RESTAURANTE CAMINOS DE HERRADURA"]
[]
["KARDEX"]
[]
["Artículo:","ACEITE","CODIGO ",null,"Unidad de medida:",null,"LIBRAS"]
["Método:","PROMEDIO PONDERADO",null,null,"Fecha de Corte:",null,{"$f":"NOW()","v":"2010-06-10T17:02:54.760"}]
[]
["FECHA","ORDEN DE \nPRODUCCIÓN","DETALLE",{"$nulls":6},"EXISTENCIAS",null,null,"RESPONSABLE"]
[{"$nulls":3},"CANT.","P.U.","P.T.","CANT.","P.U.","P.T.","CANT.","P.U.","P.T."]

{"sheet":"S7","index":61,"n_rows":9,"n_cols":13,"rows_kept":9,"merged":[[0,0,0,12],[2,0,2,12],[5,6,5,7],[7,0,8,0],[7,1,8,1],[7,2,8,2],[7,3,7,5],[7,6,7,8],[7,9,7,11],[7,12,8,12]]}
["RESTAURANTE CAMINOS DE HERRADURA"]
[]
["KARDEX"]
[]
["Artículo:","ACEITE","CODIGO ",null,"Unidad de medida:",null,"LIBRAS"]
["Método:","PROMEDIO PONDERADO",null,null,"Fecha de Corte:",null,{"$f":"NOW()","v":"2010-06-10T17:02:54.760"}]
[]
["FECHA","ORDEN DE \nPRODUCCIÓN","DETALLE",{"$nulls":6},"EXISTENCIAS",null,null,"RESPONSABLE"]
[{"$nulls":3},"CANT.","P.U.","P.T.","CANT.","P.U.","P.T.","CANT.","P.U.","P.T."]

{"sheet":"S8","index":62,"n_rows":9,"n_cols":13,"rows_kept":9,"merged":[[0,0,0,12],[2,0,2,12],[5,6,5,7],[7,0,8,0],[7,1,8,1],[7,2,8,2],[7,3,7,5],[7,6,7,8],[7,9,7,11],[7,12,8,12]]}
["RESTAURANTE CAMINOS DE HERRADURA"]
[]
["KARDEX"]
[]
["Artículo:","ACEITE","CODIGO ",null,"Unidad de medida:",null,"LIBRAS"]
["Método:","PROMEDIO PONDERADO",null,null,"Fecha de Corte:",null,{"$f":"NOW()","v":"2010-06-10T17:02:54.760"}]
[]
["FECHA","ORDEN DE \nPRODUCCIÓN","DETALLE",{"$nulls":6},"EXISTENCIAS",null,null,"RESPONSABLE"]
[{"$nulls":3},"CANT.","P.U.","P.T.","CANT.","P.U.","P.T.","CANT.","P.U.","P.T."]

{"sheet":"S9","index":63,"n_rows":9,"n_cols":13,"rows_kept":9,"merged":[[0,0,0,12],[2,0,2,12],[5,6,5,7],[7,0,8,0],[7,1,8,1],[7,2,8,2],[7,3,7,5],[7,6,7,8],[7,9,7,11],[7,12,8,12]]}
["RESTAURANTE CAMINOS DE HERRADURA"]
[]
["KARDEX"]
[]
["Artículo:","ACEITE","CODIGO ",null,"Unidad de medida:",null,"LIBRAS"]
["Método:","PROMEDIO PONDERADO",null,null,"Fecha de Corte:",null,{"$f":"NOW()","v":"2010-06-10T17:02:54.760"}]
[]
["FECHA","ORDEN DE \nPRODUCCIÓN","DETALLE",{"$nulls":6},"EXISTENCIAS",null,null,"RESPONSABLE"]
[{"$nulls":3},"CANT.","P.U.","P.T.","CANT.","P.U.","P.T.","CANT.","P.U.","P.T."]

{"sheet":"S10","index":64,"n_rows":9,"n_cols":13,"rows_kept":9,"merged":[[0,0,0,12],[2,0,2,12],[5,6,5,7],[7,0,8,0],[7,1,8,1],[7,2,8,2],[7,3,7,5],[7,6,7,8],[7,9,7,11],[7,12,8,12]]}
["RESTAURANTE CAMINOS DE HERRADURA"]
[]
["KARDEX"]
[]
["Artículo:","ACEITE","CODIGO ",null,"Unidad de medida:",null,"LIBRAS"]
["Método:","PROMEDIO PONDERADO",null,null,"Fecha de Corte:",null,{"$f":"NOW()","v":"2010-06-10T17:02:54.760"}]
[]
["FECHA","ORDEN DE \nPRODUCCIÓN","DETALLE",{"$nulls":6},"EXISTENCIAS",null,null,"RESPONSABLE"]
[{"$nulls":3},"CANT.","P.U.","P.T.","CANT.","P.U.","P.T.","CANT.","P.U.","P.T."]

{"sheet":"S11","index":65,"n_rows":9,"n_cols":13,"rows_kept":9,"merged":[[0,0,0,12],[2,0,2,12],[5,6,5,7],[7,0,8,0],[7,1,8,1],[7,2,8,2],[7,3,7,5],[7,6,7,8],[7,9,7,11],[7,12,8,12]]}
["RESTAURANTE CAMINOS DE HERRADURA"]
[]
["KARDEX"]
[]
["Artículo:","ACEITE","CODIGO ",null,"Unidad de medida:",null,"LIBRAS"]
["Método:","PROMEDIO PONDERADO",null,null,"Fecha de Corte:",null,{"$f":"NOW()","v":"2010-06-10T17:02:54.760"}]
[]
["FECHA","ORDEN DE \nPRODUCCIÓN","DETALLE",{"$nulls":6},"EXISTENCIAS",null,null,"RESPONSABLE"]
[{"$nulls":3},"CANT.","P.U.","P.T.","CANT.","P.U.","P.T.","CANT.","P.U.","P.T."]

{"sheet":"S12","index":66,"n_rows":9,"n_cols":13,"rows_kept":9,"merged":[[0,0,0,12],[2,0,2,12],[5,6,5,7],[7,0,8,0],[7,1,8,1],[7,2,8,2],[7,3,7,5],[7,6,7,8],[7,9,7,11],[7,12,8,12]]}
["RESTAURANTE CAMINOS DE HERRADURA"]
[]
["KARDEX"]
[]
["Artículo:","ACEITE","CODIGO ",null,"Unidad de medida:",null,"LIBRAS"]
["Método:","PROMEDIO PONDERADO",null,null,"Fecha de Corte:",null,{"$f":"NOW()","v":"2010-06-10T17:02:54.760"}]
[]
["FECHA","ORDEN DE \nPRODUCCIÓN","DETALLE",{"$nulls":6},"EXISTENCIAS",null,null,"RESPONSABLE"]
[{"$nulls":3},"CANT.","P.U.","P.T.","CANT.","P.U.","P.T.","CANT.","P.U.","P.T."]

{"sheet":"S13","index":67,"n_rows":9,"n_cols":13,"rows_kept":9,"merged":[[0,0,0,12],[2,0,2,12],[5,6,5,7],[7,0,8,0],[7,1,8,1],[7,2,8,2],[7,3,7,5],[7,6,7,8],[7,9,7,11],[7,12,8,12]]}
["RESTAURANTE CAMINOS DE HERRADURA"]
[]
["KARDEX"]
[]
["Artículo:","ACEITE","CODIGO ",null,"Unidad de medida:",null,"LIBRAS"]
["Método:","PROMEDIO PONDERADO",null,null,"Fecha de Corte:",null,{"$f":"NOW()","v":"2010-06-10T17:02:54.760"}]
[]
["FECHA","ORDEN DE \nPRODUCCIÓN","DETALLE",{"$nulls":6},"EXISTENCIAS",null,null,"RESPONSABLE"]
[{"$nulls":3},"CANT.","P.U.","P.T.","CANT.","P.U.","P.T.","CANT.","P.U.","P.T."]

{"sheet":"S14","index":68,"n_rows":9,"n_cols":13,"rows_kept":9,"merged":[[0,0,0,12],[2,0,2,12],[5,6,5,7],[7,0,8,0],[7,1,8,1],[7,2,8,2],[7,3,7,5],[7,6,7,8],[7,9,7,11],[7,12,8,12]]}
["RESTAURANTE CAMINOS DE HERRADURA"]
[]
["KARDEX"]
[]
["Artículo:","ACEITE","CODIGO ",null,"Unidad de medida:",null,"LIBRAS"]
["Método:","PROMEDIO PONDERADO",null,null,"Fecha de Corte:",null,{"$f":"NOW()","v":"2010-06-10T17:02:54.760"}]
[]
["FECHA","ORDEN DE \nPRODUCCIÓN","DETALLE",{"$nulls":6},"EXISTENCIAS",null,null,"RESPONSABLE"]
[{"$nulls":3},"CANT.","P.U.","P.T.","CANT.","P.U.","P.T.","CANT.","P.U.","P.T."]

{"sheet":"S15","index":69,"n_rows":9,"n_cols":13,"rows_kept":9,"merged":[[0,0,0,12],[2,0,2,12],[5,6,5,7],[7,0,8,0],[7,1,8,1],[7,2,8,2],[7,3,7,5],[7,6,7,8],[7,9,7,11],[7,12,8,12]]}
["RESTAURANTE CAMINOS DE HERRADURA"]
[]
["KARDEX"]
[]
["Artículo:","ACEITE","CODIGO ",null,"Unidad de medida:",null,"LIBRAS"]
["Método:","PROMEDIO PONDERADO",null,null,"Fecha de Corte:",null,{"$f":"NOW()","v":"2010-06-10T17:02:54.760"}]
[]
["FECHA","ORDEN DE \nPRODUCCIÓN","DETALLE",{"$nulls":6},"EXISTENCIAS",null,null,"RESPONSABLE"]
[{"$nulls":3},"CANT.","P.U.","P.T.","CANT.","P.U.","P.T.","CANT.","P.U.","P.T."]

{"sheet":"S16","index":70,"n_rows":9,"n_cols":13,"rows_kept":9,"merged":[[0,0,0,12],[2,0,2,12],[5,6,5,7],[7,0,8,0],[7,1,8,1],[7,2,8,2],[7,3,7,5],[7,6,7,8],[7,9,7,11],[7,12,8,12]]}
["RESTAURANTE CAMINOS DE HERRADURA"]
[]
["KARDEX"]
[]
["Artículo:","ACEITE","CODIGO ",null,"Unidad de medida:",null,"LIBRAS"]
["Método:","PROMEDIO PONDERADO",null,null,"Fecha de Corte:",null,{"$f":"NOW()","v":"2010-06-10T17:02:54.760"}]
[]
["FECHA","ORDEN DE \nPRODUCCIÓN","DETALLE",{"$nulls":6},"EXISTENCIAS",null,null,"RESPONSABLE"]
[{"$nulls":3},"CANT.","P.U.","P.T.","CANT.","P.U.","P.T.","CANT.","P.U.","P.T."]

{"sheet":"S17","index":71,"n_rows":9,"n_cols":13,"rows_kept":9,"merged":[[0,0,0,12],[2,0,2,12],[5,6,5,7],[7,0,8,0],[7,1,8,1],[7,2,8,2],[7,3,7,5],[7,6,7,8],[7,9,7,11],[7,12,8,12]]}
["RESTAURANTE CAMINOS DE HERRADURA"]
[]
["KARDEX"]
[]
["Artículo:","ACEITE","CODIGO ",null,"Unidad de medida:",null,"LIBRAS"]
["Método:","PROMEDIO PONDERADO",null,null,"Fecha de Corte:",null,{"$f":"NOW()","v":"2010-06-10T17:02:54.760"}]
[]
["FECHA","ORDEN DE \nPRODUCCIÓN","DETALLE",{"$nulls":6},"EXISTENCIAS",null,null,"RESPONSABLE"]
[{"$nulls":3},"CANT.","P.U.","P.T.","CANT.","P.U.","P.T.","CANT.","P.U.","P.T."]

{"sheet":"S18","index":72,"n_rows":9,"n_cols":13,"rows_kept":9,"merged":[[0,0,0,12],[2,0,2,12],[5,6,5,7],[7,0,8,0],[7,1,8,1],[7,2,8,2],[7,3,7,5],[7,6,7,8],[7,9,7,11],[7,12,8,12]]}
["RESTAURANTE CAMINOS DE HERRADURA"]
[]
["KARDEX"]
[]
["Artículo:","ACEITE","CODIGO ",null,"Unidad de medida:",null,"LIBRAS"]
["Método:","PROMEDIO PONDERADO",null,null,"Fecha de Corte:",null,{"$f":"NOW()","v":"2010-06-10T17:02:54.760"}]
[]
["FECHA","ORDEN DE \nPRODUCCIÓN","DETALLE",{"$nulls":6},"EXISTENCIAS",null,null,"RESPONSABLE"]
[{"$nulls":3},"CANT.","P.U.","P.T.","CANT.","P.U.","P.T.","CANT.","P.U.","P.T."]

{"sheet":"S19","index":73,"n_rows":9,"n_cols":13,"rows_kept":9,"merged":[[0,0,0,12],[2,0,2,12],[5,6,5,7],[7,0,8,0],[7,1,8,1],[7,2,8,2],[7,3,7,5],[7,6,7,8],[7,9,7,11],[7,12,8,12]]}
["RESTAURANTE CAMINOS DE HERRADURA"]
[]
["KARDEX"]
[]
["Artículo:","ACEITE","CODIGO ",null,"Unidad de medida:",null,"LIBRAS"]
["Método:","PROMEDIO PONDERADO",null,null,"Fecha de Corte:",null,{"$f":"NOW()","v":"2010-06-10T17:02:54.760"}]
[]
["FECHA","ORDEN DE \nPRODUCCIÓN","DETALLE",{"$nulls":6},"EXISTENCIAS",null,null,"RESPONSABLE"]
[{"$nulls":3},"CANT.","P.U.","P.T.","CANT.","P.U.","P.T.","CANT.","P.U.","P.T."]

{"sheet":"S20","index":74,"n_rows":9,"n_cols":13,"rows_kept":9,"merged":[[0,0,0,12],[2,0,2,12],[5,6,5,7],[7,0,8,0],[7,1,8,1],[7,2,8,2],[7,3,7,5],[7,6,7,8],[7,9,7,11],[7,12,8,12]]}
["RESTAURANTE CAMINOS DE HERRADURA"]
[]
["KARDEX"]
[]
["Artículo:","ACEITE","CODIGO ",null,"Unidad de medida:",null,"LIBRAS"]
["Método:","PROMEDIO PONDERADO",null,null,"Fecha de Corte:",null,{"$f":"NOW()","v":"2010-06-10T17:02:54.760"}]
[]
["FECHA","ORDEN DE \nPRODUCCIÓN","DETALLE",{"$nulls":6},"EXISTENCIAS",null,null,"RESPONSABLE"]
[{"$nulls":3},"CANT.","P.U.","P.T.","CANT.","P.U.","P.T.","CANT.","P.U.","P.T."]

{"sheet":"S21","index":75,"n_rows":9,"n_cols":13,"rows_kept":9,"merged":[[0,0,0,12],[2,0,2,12],[5,6,5,7],[7,0,8,0],[7,1,8,1],[7,2,8,2],[7,3,7,5],[7,6,7,8],[7,9,7,11],[7,12,8,12]]}
["RESTAURANTE CAMINOS DE HERRADURA"]
[]
["KARDEX"]
[]
["Artículo:","ACEITE","CODIGO ",null,"Unidad de medida:",null,"LIBRAS"]
["Método:","PROMEDIO PONDERADO",null,null,"Fecha de Corte:",null,{"$f":"NOW()","v":"2010-06-10T17:02:54.760"}]
[]
["FECHA","ORDEN DE \nPRODUCCIÓN","DETALLE",{"$nulls":6},"EXISTENCIAS",null,null,"RESPONSABLE"]
[{"$nulls":3},"CANT.","P.U.","P.T.","CANT.","P.U.","P.T.","CANT.","P.U.","P.T."]

{"sheet":"S22","index":76,"n_rows":9,"n_cols":13,"rows_kept":9,"merged":[[0,0,0,12],[2,0,2,12],[5,6,5,7],[7,0,8,0],[7,1,8,1],[7,2,8,2],[7,3,7,5],[7,6,7,8],[7,9,7,11],[7,12,8,12]]}
["RESTAURANTE CAMINOS DE HERRADURA"]
[]
["KARDEX"]
[]
["Artículo:","ACEITE","CODIGO ",null,"Unidad de medida:",null,"LIBRAS"]
["Método:","PROMEDIO PONDERADO",null,null,"Fecha de Corte:",null,{"$f":"NOW()","v":"2010-06-10T17:02:54.760"}]
[]
["FECHA","ORDEN DE \nPRODUCCIÓN","DETALLE",{"$nulls":6},"EXISTENCIAS",null,null,"RESPONSABLE"]
[{"$nulls":3},"CANT.","P.U.","P.T.","CANT.","P.U.","P.T.","CANT.","P.U.","P.T."]

{"sheet":"S23","index":77,"n_rows":9,"n_cols":13,"rows_kept":9,"merged":[[0,0,0,12],[2,0,2,12],[5,6,5,7],[7,0,8,0],[7,1,8,1],[7,2,8,2],[7,3,7,5],[7,6,7,8],[7,9,7,11],[7,12,8,12]]}
["RESTAURANTE CAMINOS DE HERRADURA"]
[]
["KARDEX"]
[]
["Artículo:","ACEITE","CODIGO ",null,"Unidad de medida:",null,"LIBRAS"]
["Método:","PROMEDIO PONDERADO",null,null,"Fecha de Corte:",null,{"$f":"NOW()","v":"2010-06-10T17:02:54.760"}]
[]
["FECHA","ORDEN DE \nPRODUCCIÓN","DETALLE",{"$nulls":6},"EXISTENCIAS",null,null,"RESPONSABLE"]
[{"$nulls":3},"CANT.","P.U.","P.T.","CANT.","P.U.","P.T.","CANT.","P.U.","P.T."]

{"sheet":"INFORME DE INVENTARIOS","index":78,"n_rows":63,"n_cols":13,"rows_kept":63,"merged":[[1,1,1,5],[3,1,3,5],[8,1,9,1],[8,2,9,2],[8,3,8,5]]}
[]
[null,"RESTAURANTE CAMINOS DE HERRADURA",{"$nulls":5},"ACEITE",null,"LENTEJAS"]
[{"$nulls":7},"ACELGA",null,"LIMON"]
[null,"INFORME DE INVENTARIOS - MP",{"$nulls":5},"ACHOTE",null,"LOMO"]
[{"$nulls":7},"AGUACATE ",null,"MAGGI"]
[null,"Artículo:","TODOS","Unidad de medida:","Libras",null,null,"AJO ",null,"MAIZ"]
[{"$nulls":3},"Fecha de corte:",{"$f":"NOW()","v":"2010-06-10T17:02:54.760"},null,null,"APANADURA",null,"MANTECA"]
[{"$nulls":7},"APIO",null,"MANTEQUILLA"]
[null,"CODIGO","PRODUCTO","EXISTENCIAS",{"$nulls":3},"ARROZ",null,"MARACUYA"]
[{"$nulls":3},"CANT.","P.U.","P.T.",null,"ARVEJA",null,"MELLOCOS"]
[null,{"$f":"'MATERIA PRIMA Y MATERIALES'!D10","v":"1.1.04.01"},{"$f":"IF(MID('M1'!B5,1,1)=\"#\",\"\",'M1'!B5)","v":"ARROZ"},{"$f":"'M1'!J10","v":{"v":79.8,"d":"79.80"}},{"$f":"'M1'!K10","v":{"v":0.35,"d":"$0.35"}},{"$f":"'M1'!L10","v":{"v":27.929999999999996,"d":"$27.93"}},null,"AZUCAR",null,"MORA"]
[null,{"$f":"'MATERIA PRIMA Y MATERIALES'!D11","v":"1.1.04.02"},{"$f":"IF(MID('M2'!B5,1,1)=\"#\",\"\",'M2'!B5)","v":"ACEITE"},{"$f":"'M2'!J10","v":{"v":65,"d":"65.00"}},{"$f":"'M2'!K10","v":{"v":0.76,"d":"$0.76"}},{"$f":"'M2'!L10","v":{"v":49.4,"d":"$49.40"}},null,"BROCOLI",null,"MOROCHO","AVENA",null,"MELON"]
[null,{"$f":"'MATERIA PRIMA Y MATERIALES'!D12","v":"1.1.04.03"},{"$f":"IF(MID('M3'!B5,1,1)=\"#\",\"\",'M3'!B5)","v":"AZUCAR"},{"$f":"'M3'!J10","v":{"v":50.5,"d":"50.50"}},{"$f":"'M3'!K10","v":{"v":0.32999999999999996,"d":"$0.33"}},{"$f":"'M3'!L10","v":{"v":16.665,"d":"$16.67"}},null,"CALABAZA",null,"MORTADELA"]
[null,{"$f":"'MATERIA PRIMA Y MATERIALES'!D13","v":"1.1.04.04"},{"$f":"IF(MID('M4'!B5,1,1)=\"#\",\"\",'M4'!B5)","v":"LOMO"},{"$f":"'M4'!J10","v":{"v":11,"d":"11.00"}},{"$f":"'M4'!K10","v":{"v":2,"d":"$2.00"}},{"$f":"'M4'!L10","v":{"v":22,"d":"$22.00"}},null,"CAMARONES",null,"MOSTAZA"]
[null,{"$f":"'MATERIA PRIMA Y MATERIALES'!D14","v":"1.1.04.05"},{"$f":"IF(MID('M5'!B5,1,1)=\"#\",\"\",'M5'!B5)","v":"PAPAS"},{"$f":"'M5'!J10","v":{"v":200,"d":"200.00"}},{"$f":"'M5'!K10","v":{"v":0.12,"d":"$0.12"}},{"$f":"'M5'!L10","v":{"v":24,"d":"$24.00"}},null,"CANELA",null,"NARANJILLA"]
[null,{"$f":"'MATERIA PRIMA Y MATERIALES'!D15","v":"1.1.04.06"},{"$f":"IF(MID('M6'!B5,1,1)=\"#\",\"\",'M6'!B5)","v":"POLLO"},{"$f":"'M6'!J10","v":{"v":0,"d":"0.00"}},{"$f":"'M6'!K10","v":0},{"$f":"'M6'!L10","v":0},null,"CANGUIL ",null,"NUEZ MOSCADA"]
[null,{"$f":"'MATERIA PRIMA Y MATERIALES'!D16","v":"1.1.04.07"},{"$f":"IF(MID('M7'!B5,1,1)=\"#\",\"\",'M7'!B5)","v":""},{"$f":"'M7'!J10","v":{"v":0,"d":"0.00"}},{"$f":"'M7'!K10","v":0},{"$f":"'M7'!L10","v":0},null,"CARNE MOLIDA",null,"OREGANO"]
[null,{"$f":"'MATERIA PRIMA Y MATERIALES'!D17","v":"1.1.04.08"},{"$f":"IF(MID('M8'!B5,1,1)=\"#\",\"\",'M8'!B5)","v":""},{"$f":"'M8'!J10","v":{"v":0,"d":"0.00"}},{"$f":"'M8'!K10","v":0},{"$f":"'M8'!L10","v":0},null,"CEBOLLA",null,"PAPAS"]
[null,{"$f":"'MATERIA PRIMA Y MATERIALES'!D18","v":"1.1.04.09"},{"$f":"IF(MID('M9'!B5,1,1)=\"#\",\"\",'M9'!B5)","v":""},{"$f":"'M9'!J10","v":{"v":0,"d":"0.00"}},{"$f":"'M9'!K10","v":0},{"$f":"'M9'!L10","v":0},null,"CEBOLLA LARGA",null,"PAPAYA"]
[null,{"$f":"'MATERIA PRIMA Y MATERIALES'!D19","v":"1.1.04.10"},{"$f":"IF(MID('M10'!B5,1,1)=\"#\",\"\",'M10'!B5)","v":""},{"$f":"'M10'!J10","v":{"v":0,"d":"0.00"}},{"$f":"'M10'!K10","v":0},{"$f":"'M10'!L10","v":0},null,"CEDRON",null,"PEPINILLO"]
[null,{"$f":"'MATERIA PRIMA Y MATERIALES'!D20","v":"1.1.04.11"},{"$f":"IF(MID('M11'!B5,1,1)=\"#\",\"\",'M11'!B5)","v":""},{"$f":"'M11'!J10","v":{"v":0,"d":"0.00"}},{"$f":"'M11'!K10","v":0},{"$f":"'M11'!L10","v":0},null,"CHAMPIÑONES",null,"PEREJIL"]
[null,{"$f":"'MATERIA PRIMA Y MATERIALES'!D21","v":"1.1.04.12"},{"$f":"IF(MID('M12'!B5,1,1)=\"#\",\"\",'M12'!B5)","v":""},{"$f":"'M12'!J10","v":{"v":0,"d":"0.00"}},{"$f":"'M12'!K10","v":0},{"$f":"'M12'!L10","v":0},null,"CHANCHO",null,"PESCADO"]
[null,{"$f":"'MATERIA PRIMA Y MATERIALES'!D22","v":"1.1.04.13"},{"$f":"IF(MID('M13'!B5,1,1)=\"#\",\"\",'M13'!B5)","v":""},{"$f":"'M13'!J10","v":{"v":0,"d":"0.00"}},{"$f":"'M13'!K10","v":0},{"$f":"'M13'!L10","v":0},null,"CHOCHOS ",null,"PIMIENTA"]
[null,{"$f":"'MATERIA PRIMA Y MATERIALES'!D23","v":"1.1.04.14"},{"$f":"IF(MID('M14'!B5,1,1)=\"#\",\"\",'M14'!B5)","v":""},{"$f":"'M14'!J10","v":{"v":0,"d":"0.00"}},{"$f":"'M14'!K10","v":0},{"$f":"'M14'!L10","v":0},null,"CHUCHUCA ",null,"PIMIENTA"]
[null,{"$f":"'MATERIA PRIMA Y MATERIALES'!D24","v":"1.1.04.15"},{"$f":"IF(MID('M15'!B5,1,1)=\"#\",\"\",'M15'!B5)","v":""},{"$f":"'M15'!J10","v":{"v":0,"d":"0.00"}},{"$f":"'M15'!K10","v":0},{"$f":"'M15'!L10","v":0},null,"CHULETA ",null,"PIMIENTOS "]
[null,{"$f":"'MATERIA PRIMA Y MATERIALES'!D25","v":"1.1.04.16"},{"$f":"IF(MID('M16'!B5,1,1)=\"#\",\"\",'M16'!B5)","v":""},{"$f":"'M16'!J10","v":{"v":0,"d":"0.00"}},{"$f":"'M16'!K10","v":0},{"$f":"'M16'!L10","v":0},null,"CLAVOS DE OLOR",null,"PIÑA"]
[null,{"$f":"'MATERIA PRIMA Y MATERIALES'!D26","v":"1.1.04.17"},{"$f":"IF(MID('M17'!B5,1,1)=\"#\",\"\",'M17'!B5)","v":""},{"$f":"'M17'!J10","v":{"v":0,"d":"0.00"}},{"$f":"'M17'!K10","v":0},{"$f":"'M17'!L10","v":0},null,"COL",null,"PLATANO MADURO"]
[null,{"$f":"'MATERIA PRIMA Y MATERIALES'!D27","v":"1.1.04.18"},{"$f":"IF(MID('M18'!B5,1,1)=\"#\",\"\",'M18'!B5)","v":""},{"$f":"'M18'!J10","v":{"v":0,"d":"0.00"}},{"$f":"'M18'!K10","v":0},{"$f":"'M18'!L10","v":0},null,"COL MORADA",null,"POLLOS "]
[null,{"$f":"'MATERIA PRIMA Y MATERIALES'!D28","v":"1.1.04.19"},{"$f":"IF(MID('M19'!B5,1,1)=\"#\",\"\",'M19'!B5)","v":""},{"$f":"'M19'!J10","v":{"v":0,"d":"0.00"}},{"$f":"'M19'!K10","v":0},{"$f":"'M19'!L10","v":0},null,"COLIFLOR",null,"QUESO"]
[null,{"$f":"'MATERIA PRIMA Y MATERIALES'!D29","v":"1.1.04.20"},{"$f":"IF(MID('M20'!B5,1,1)=\"#\",\"\",'M20'!B5)","v":""},{"$f":"'M20'!J10","v":{"v":0,"d":"0.00"}},{"$f":"'M20'!K10","v":0},{"$f":"'M20'!L10","v":0},null,"COMINO ",null,"QUINOA"]
[null,{"$f":"'MATERIA PRIMA Y MATERIALES'!D30","v":"1.1.04.21"},{"$f":"IF(MID('M21'!B5,1,1)=\"#\",\"\",'M21'!B5)","v":""},{"$f":"'M21'!J10","v":{"v":0,"d":"0.00"}},{"$f":"'M21'!K10","v":0},{"$f":"'M21'!L10","v":0},null,"CORVINA",null,"RABANO"]
[null,{"$f":"'MATERIA PRIMA Y MATERIALES'!D31","v":"1.1.04.22"},{"$f":"IF(MID('M22'!B5,1,1)=\"#\",\"\",'M22'!B5)","v":""},{"$f":"'M22'!J10","v":{"v":0,"d":"0.00"}},{"$f":"'M22'!K10","v":0},{"$f":"'M22'!L10","v":0},null,"CREMA DE LECHE",null,"REMOLACHA"]
[null,{"$f":"'MATERIA PRIMA Y MATERIALES'!D32","v":"1.1.04.23"},{"$f":"IF(MID('M23'!B5,1,1)=\"#\",\"\",'M23'!B5)","v":""},{"$f":"'M23'!J10","v":{"v":0,"d":"0.00"}},{"$f":"'M23'!K10","v":0},{"$f":"'M23'!L10","v":0},null,"CULANTRO",null,"SAL "]
[null,{"$f":"'MATERIA PRIMA Y MATERIALES'!D33","v":"1.1.04.24"},{"$f":"IF(MID('M24'!B5,1,1)=\"#\",\"\",'M24'!B5)","v":""},{"$f":"'M24'!J10","v":{"v":0,"d":"0.00"}},{"$f":"'M24'!K10","v":0},{"$f":"'M24'!L10","v":0},null,"FIDEOS",null,"SALCHICHAS"]
[null,{"$f":"'MATERIA PRIMA Y MATERIALES'!D34","v":"1.1.04.25"},{"$f":"IF(MID('M25'!B5,1,1)=\"#\",\"\",'M25'!B5)","v":""},{"$f":"'M25'!J10","v":{"v":0,"d":"0.00"}},{"$f":"'M25'!K10","v":0},{"$f":"'M25'!L10","v":0},null,"FREJOL",null,"SALSA CHINA"]
[null,{"$f":"'MATERIA PRIMA Y MATERIALES'!D35","v":"1.1.04.26"},{"$f":"IF(MID('M26'!B5,1,1)=\"#\",\"\",'M26'!B5)","v":""},{"$f":"'M26'!J10","v":{"v":0,"d":"0.00"}},{"$f":"'M26'!K10","v":0},{"$f":"'M26'!L10","v":0},null,"GUANABANA",null,"SALSA INGLESA"]
[null,{"$f":"'MATERIA PRIMA Y MATERIALES'!D36","v":"1.1.04.27"},{"$f":"IF(MID('M27'!B5,1,1)=\"#\",\"\",'M27'!B5)","v":""},{"$f":"'M27'!J10","v":{"v":0,"d":"0.00"}},{"$f":"'M27'!K10","v":0},{"$f":"'M27'!L10","v":0},null,"GUAYABA",null,"SANDIA"]
[null,{"$f":"'MATERIA PRIMA Y MATERIALES'!D37","v":"1.1.04.28"},{"$f":"IF(MID('M28'!B5,1,1)=\"#\",\"\",'M28'!B5)","v":""},{"$f":"'M28'!J10","v":{"v":0,"d":"0.00"}},{"$f":"'M28'!K10","v":0},{"$f":"'M28'!L10","v":0},null,"HABAS",null,"SANGRE"]
[null,{"$f":"'MATERIA PRIMA Y MATERIALES'!D38","v":"1.1.04.29"},{"$f":"IF(MID('M29'!B5,1,1)=\"#\",\"\",'M29'!B5)","v":""},{"$f":"'M29'!J10","v":{"v":0,"d":"0.00"}},{"$f":"'M29'!K10","v":0},{"$f":"'M29'!L10","v":0},null,"HARINA",null,"TALLARIN"]
[null,{"$f":"'MATERIA PRIMA Y MATERIALES'!D39","v":"1.1.04.30"},{"$f":"IF(MID('M30'!B5,1,1)=\"#\",\"\",'M30'!B5)","v":""},{"$f":"'M30'!J10","v":{"v":0,"d":"0.00"}},{"$f":"'M30'!K10","v":0},{"$f":"'M30'!L10","v":0},null,"HIERBA LUISA",null,"TOMATE DE ARBOL"]
[null,{"$f":"'MATERIA PRIMA Y MATERIALES'!D40","v":"1.1.04.31"},{"$f":"IF(MID('M31'!B5,1,1)=\"#\",\"\",'M31'!B5)","v":""},{"$f":"'M31'!J10","v":{"v":0,"d":"0.00"}},{"$f":"'M31'!K10","v":0},{"$f":"'M31'!L10","v":0},null,"HIGADO",null,"TOMATE RIÑON"]
[null,{"$f":"'MATERIA PRIMA Y MATERIALES'!D41","v":"1.1.04.32"},{"$f":"IF(MID('M32'!B5,1,1)=\"#\",\"\",'M32'!B5)","v":""},{"$f":"'M32'!J10","v":{"v":0,"d":"0.00"}},{"$f":"'M32'!K10","v":0},{"$f":"'M32'!L10","v":0},null,"HUEVOS",null,"TOSINO"]
[null,{"$f":"'MATERIA PRIMA Y MATERIALES'!D42","v":"1.1.04.33"},{"$f":"IF(MID('M33'!B5,1,1)=\"#\",\"\",'M33'!B5)","v":""},{"$f":"'M33'!J10","v":{"v":0,"d":"0.00"}},{"$f":"'M33'!K10","v":0},{"$f":"'M33'!L10","v":0},null,"JAMON ",null,"VAINITA"]
[null,{"$f":"'MATERIA PRIMA Y MATERIALES'!D43","v":"1.1.04.34"},{"$f":"IF(MID('M34'!B5,1,1)=\"#\",\"\",'M34'!B5)","v":""},{"$f":"'M34'!J10","v":{"v":0,"d":"0.00"}},{"$f":"'M34'!K10","v":0},{"$f":"'M34'!L10","v":0},null,"LECHE",null,"VERDE"]
[null,{"$f":"'MATERIA PRIMA Y MATERIALES'!D44","v":"1.1.04.35"},{"$f":"IF(MID('M35'!B5,1,1)=\"#\",\"\",'M35'!B5)","v":""},{"$f":"'M35'!J10","v":{"v":0,"d":"0.00"}},{"$f":"'M35'!K10","v":0},{"$f":"'M35'!L10","v":0},null,"LECHUGA",null,"YERBA BUENA"]
[null,{"$f":"'MATERIA PRIMA Y MATERIALES'!D45","v":"1.1.04.36"},{"$f":"IF(MID('M36'!B5,1,1)=\"#\",\"\",'M36'!B5)","v":""},{"$f":"'M36'!J10","v":{"v":0,"d":"0.00"}},{"$f":"'M36'!K10","v":0},{"$f":"'M36'!L10","v":0},null,"LENGUA",null,"YUCA"]
[null,{"$f":"'MATERIA PRIMA Y MATERIALES'!D46","v":"1.1.04.37"},{"$f":"IF(MID('M37'!B5,1,1)=\"#\",\"\",'M37'!B5)","v":""},{"$f":"'M37'!J10","v":{"v":0,"d":"0.00"}},{"$f":"'M37'!K10","v":0},{"$f":"'M37'!L10","v":0},{"$nulls":3},"ZANAHORIA BLANCA"]
[null,{"$f":"'MATERIA PRIMA Y MATERIALES'!D47","v":"1.1.04.38"},{"$f":"IF(MID('M38'!B5,1,1)=\"#\",\"\",'M38'!B5)","v":""},{"$f":"'M38'!J10","v":{"v":0,"d":"0.00"}},{"$f":"'M38'!K10","v":0},{"$f":"'M38'!L10","v":0},{"$nulls":3},"ZANAHORIA AMARILLA"]
[null,{"$f":"'MATERIA PRIMA Y MATERIALES'!D48","v":"1.1.04.39"},{"$f":"IF(MID('M39'!B5,1,1)=\"#\",\"\",'M39'!B5)","v":""},{"$f":"'M39'!J10","v":{"v":0,"d":"0.00"}},{"$f":"'M39'!K10","v":0},{"$f":"'M39'!L10","v":0}]
[null,{"$f":"'MATERIA PRIMA Y MATERIALES'!D49","v":"1.1.04.40"},{"$f":"IF(MID('M40'!B5,1,1)=\"#\",\"\",'M40'!B5)","v":""},{"$f":"'M40'!J10","v":{"v":0,"d":"0.00"}},{"$f":"'M40'!K10","v":0},{"$f":"'M40'!L10","v":0}]
[null,{"$f":"'MATERIA PRIMA Y MATERIALES'!D50","v":"1.1.04.41"},{"$f":"IF(MID('M41'!B5,1,1)=\"#\",\"\",'M41'!B5)","v":""},{"$f":"'M41'!J10","v":{"v":0,"d":"0.00"}},{"$f":"'M41'!K10","v":0},{"$f":"'M41'!L10","v":0}]
[null,{"$f":"'MATERIA PRIMA Y MATERIALES'!D51","v":"1.1.04.42"},{"$f":"IF(MID('M42'!B5,1,1)=\"#\",\"\",'M42'!B5)","v":""},{"$f":"'M42'!J10","v":{"v":0,"d":"0.00"}},{"$f":"'M42'!K10","v":0},{"$f":"'M42'!L10","v":0}]
[null,{"$f":"'MATERIA PRIMA Y MATERIALES'!D52","v":"1.1.04.43"},{"$f":"IF(MID('M43'!B5,1,1)=\"#\",\"\",'M43'!B5)","v":""},{"$f":"'M43'!J10","v":{"v":0,"d":"0.00"}},{"$f":"'M43'!K10","v":0},{"$f":"'M43'!L10","v":0}]
[null,{"$f":"'MATERIA PRIMA Y MATERIALES'!D53","v":"1.1.04.44"},{"$f":"IF(MID('M44'!B5,1,1)=\"#\",\"\",'M44'!B5)","v":""},{"$f":"'M44'!J10","v":{"v":0,"d":"0.00"}},{"$f":"'M44'!K10","v":0},{"$f":"'M44'!L10","v":0}]
[null,{"$f":"'MATERIA PRIMA Y MATERIALES'!D54","v":"1.1.04.45"},{"$f":"IF(MID('M45'!B5,1,1)=\"#\",\"\",'M45'!B5)","v":""},{"$f":"'M45'!J10","v":{"v":0,"d":"0.00"}},{"$f":"'M45'!K10","v":0},{"$f":"'M45'!L10","v":0}]
[null,{"$f":"'MATERIA PRIMA Y MATERIALES'!D55","v":"1.1.04.46"},{"$f":"IF(MID('M46'!B5,1,1)=\"#\",\"\",'M46'!B5)","v":""},{"$f":"'M46'!J10","v":{"v":0,"d":"0.00"}},{"$f":"'M46'!K10","v":0},{"$f":"'M46'!L10","v":0}]
[null,{"$f":"'MATERIA PRIMA Y MATERIALES'!D56","v":"1.1.04.47"},{"$f":"IF(MID('M47'!B5,1,1)=\"#\",\"\",'M47'!B5)","v":""},{"$f":"'M47'!J10","v":{"v":0,"d":"0.00"}},{"$f":"'M47'!K10","v":0},{"$f":"'M47'!L10","v":0}]
[null,{"$f":"'MATERIA PRIMA Y MATERIALES'!D57","v":"1.1.04.48"},{"$f":"IF(MID('M48'!B5,1,1)=\"#\",\"\",'M48'!B5)","v":""},{"$f":"'M48'!J10","v":{"v":0,"d":"0.00"}},{"$f":"'M48'!K10","v":0},{"$f":"'M48'!L10","v":0}]
[null,{"$f":"'MATERIA PRIMA Y MATERIALES'!D58","v":"1.1.04.49"},{"$f":"IF(MID('M49'!B5,1,1)=\"#\",\"\",'M49'!B5)","v":""},{"$f":"'M49'!J10","v":{"v":0,"d":"0.00"}},{"$f":"'M49'!K10","v":0},{"$f":"'M49'!L10","v":0}]
[null,{"$f":"'MATERIA PRIMA Y MATERIALES'!D59","v":"1.1.04.50"},{"$f":"IF(MID('M50'!B5,1,1)=\"#\",\"\",'M50'!B5)","v":""},{"$f":"'M50'!J10","v":{"v":0,"d":"0.00"}},{"$f":"'M50'!K10","v":0},{"$f":"'M50'!L10","v":0}]
[null,{"$f":"'MATERIA PRIMA Y MATERIALES'!D60","v":"1.1.04.51"},{"$f":"IF(MID('M51'!B5,1,1)=\"#\",\"\",'M51'!B5)","v":""},{"$f":"'M51'!J10","v":{"v":0,"d":"0.00"}},{"$f":"'M51'!K10","v":0},{"$f":"'M51'!L10","v":0}]
[null,{"$f":"'MATERIA PRIMA Y MATERIALES'!D61","v":"1.1.04.52"},{"$f":"IF(MID('M52'!B5,1,1)=\"#\",\"\",'M52'!B5)","v":""},{"$f":"'M52'!J10","v":{"v":0,"d":"0.00"}},{"$f":"'M52'!K10","v":0},{"$f":"'M52'!L10","v":0}]
[{"$nulls":5},{"$f":"SUM(F11:F62)","v":{"v":139.995,"d":"$140.00"}}]

{"sheet":"REPORTES","index":79,"n_rows":12,"n_cols":10,"rows_kept":12,"merged":[[0,0,0,8],[2,0,2,8],[5,2,5,3],[7,0,8,0],[7,1,8,1],[7,2,8,2],[7,3,7,5],[7,6,7,8],[11,3,11,4],[11,6,11,7]]}
["RESTAURANTE CAMINOS DE HERRADURA"]
[]
["REPORTE DE INGRESOS Y REQUISICIONES"]
[]
["Unidad de medida:",null,"LIBRAS"]
["Fecha de Corte:",null,{"$f":"NOW()","v":"2010-06-10T17:02:54.760"}]
[]
["FECHA","ORDEN DE \nPRODUCCIÓN","DETALLE","ENTRADAS",null,null,"SALIDAS"]
[{"$nulls":3},"CANT.","P.U.","P.T.","CANT.","P.U.","P.T."]
[]
[]
[{"$nulls":3},"TOTAL",null,{"$f":"SUM(F10:F11)","v":0},"TOTAL",null,{"$f":"SUM(I10:I11)","v":0},{"$f":"F12-I12","v":0}]